مهمان عزیز خوش‌آمدید. ورود عضــویت


وینوس - خروجی آفلاین اندروید
سلام
ممنون
جالا این ارور رو میده
درهنگام نصب پلاگین هم ارور میده.ولی پیشنیاز ها مشکلی ندارن
با اموزشات هم پیش رفتم جواب نداد

*
********** BUILD STARTED AT 2018/10/27 13:46:33 **********
*

Use of plugman.raw.* methods is deprecated and plugman.raw will be removed in a future release. Please migrate to using the top-level plugman.* methods instead.
(node:108) UnhandledPromiseRejectionWarning: CordovaError: Error: cmd: Command failed with exit code ENOENT
   at C:\Users\nzn\AppData\Roaming\npm\node_modules\cordova\node_modules\cordova-lib\src\plugman\fetch.js:112:45
   at _rejected (C:\Users\nzn\AppData\Roaming\npm\node_modules\cordova\node_modules\cordova-fetch\node_modules\q\q.js:864:24)
   at C:\Users\nzn\AppData\Roaming\npm\node_modules\cordova\node_modules\cordova-fetch\node_modules\q\q.js:890:30
   at Promise.when (C:\Users\nzn\AppData\Roaming\npm\node_modules\cordova\node_modules\cordova-fetch\node_modules\q\q.js:1142:31)
   at Promise.promise.promiseDispatch (C:\Users\nzn\AppData\Roaming\npm\node_modules\cordova\node_modules\cordova-fetch\node_modules\q\q.js:808:41)
   at C:\Users\nzn\AppData\Roaming\npm\node_modules\cordova\node_modules\cordova-fetch\node_modules\q\q.js:624:44

   at runSingle (C:\Users\nzn\AppData\Roaming\npm\node_modules\cordova\node_modules\cordova-fetch\node_modules\q\q.js:137:13)
   at flush (C:\Users\nzn\AppData\Roaming\npm\node_modules\cordova\node_modules\cordova-fetch\node_modules\q\q.js:125:13)
   at _combinedTickCallback (internal/process/next_tick.js:131:7)
   at process._tickCallback (internal/process/next_tick.js:180:9)
(node:108) UnhandledPromiseRejectionWarning: Unhandled promise rejection. This error originated either by throwing inside of an async function without a catch block, or by rejecting a promise which was not handled with .catch(). (rejection id: 1)
(node:108) [DEP0018] DeprecationWarning: Unhandled promise rejections are deprecated. In the future, promise rejections that are not handled will terminate the Node.js process with a non-zero exit code.

Removing platform android from config.xml file...


Using cordova-fetch for [email protected]:\Program Files\Vinoos\Data\platforms\3.7.2.tgz
(node:3256) UnhandledPromiseRejectionWarning: CordovaError: Failed to fetch platform [email protected]:\Program Files\Vinoos\Data\platforms\3.7.2.tgz
Probably this is either a connection problem, or platform spec is incorrect.
Check your connection and platform name/version/URL.
Error: cmd: Command failed with exit code ENOENT
   at C:\Users\nzn\AppData\Roaming\npm\node_modules\cordova\node_modules\cordova-lib\src\cordova\platform.js:312:25
   at _rejected (C:\Users\nzn\AppData\Roaming\npm\node_modules\cordova\node_modules\cordova-lib\node_modules\q\q.js:797:24)

   at C:\Users\nzn\AppData\Roaming\npm\node_modules\cordova\node_modules\cordova-lib\node_modules\q\q.js:823:30
   at Promise.when (C:\Users\nzn\AppData\Roaming\npm\node_modules\cordova\node_modules\cordova-fetch\node_modules\q\q.js:1142:31)
   at Promise.promise.promiseDispatch (C:\Users\nzn\AppData\Roaming\npm\node_modules\cordova\node_modules\cordova-fetch\node_modules\q\q.js:808:41)
   at C:\Users\nzn\AppData\Roaming\npm\node_modules\cordova\node_modules\cordova-fetch\node_modules\q\q.js:624:44
   at runSingle (C:\Users\nzn\AppData\Roaming\npm\node_modules\cordova\node_modules\cordova-fetch\node_modules\q\q.js:137:13)
   at flush (C:\Users\nzn\AppData\Roaming\npm\node_modules\cordova\node_modules\cordova-fetch\node_modules\q\q.js:125:13)
   at _combinedTickCallback (internal/process/next_tick.js:131:7)
   at process._tickCallback (internal/process/next_tick.js:180:9)
(node:3256) UnhandledPromiseRejectionWarning: Unhandled promise rejection. This error originated either by throwing inside of an async function without a catch block, or by rejecting a promise which was not handled with .catch(). (rejection id: 1)
(node:3256) [DEP0018] DeprecationWarning: Unhandled promise rejections are deprecated. In the future, promise rejections that are not handled will terminate the Node.js process with a non-zero exit code.

إِنَّ مَعِيَ رَبّي سَيَهدينِ
قطعا خدا با من است و مرا راهنمایی خواهد کرد
 
پاسخ دهید
 سپاس شده توسط: S.L.F

من هم این مشکل رو دارم...

*
********** BUILD STARTED AT 2018-10-27 164401 **********
*


You have been opted out of telemetry. To change this, run: cordova telemetry on.
Removing platform android from config.xml file...



You have been opted out of telemetry. To change this, run: cordova telemetry on.
Adding android project...
Creating Cordova project for the Android platform:
Path: platforms\android
Package: com.spsoft.crazy.math.game
Name: Crazy_Math
Activity: MainActivity
Android target: android-25
Subproject Path: CordovaLib
Android project created with [email protected]
Installing "cordova-plugin-android-tools" for android
Installing "vinoos-crosswalk-arm7" for android
Subproject Path: CordovaLib
--save flag or autosave detected
Saving [email protected]:\Construct 2\Data\platforms\6.2.3.tgz into config.xml file ...



You have been opted out of telemetry. To change this, run: cordova telemetry on.
ANDROID_HOME=D:\Construct 2\Vinoos\android-sdk-windows
JAVA_HOME=C:\Program Files (x86)\JDK.8.0.172.x64
:wrapper

BUILD SUCCESSFUL

Total time: 6.658 secs
Picked up _JAVA_OPTIONS: -Xmx2g
Subproject Path: CordovaLib
Failed to notify ProjectEvaluationListener.afterEvaluate(), but primary configuration failure takes precedence.
java.lang.IllegalStateException: buildToolsVersion is not specified.
at com.google.common.base.Preconditions.checkState(Preconditions.java:173)
at com.android.build.gradle.BasePlugin.createAndroidTasks(BasePlugin.java:645)
at com.android.build.gradle.BasePlugin$10.call(BasePlugin.java:608)
at com.android.build.gradle.BasePlugin$10.call(BasePlugin.java:605)
at com.android.builder.profile.ThreadRecorder.record(ThreadRecorder.java:156)
at com.android.builder.profile.ThreadRecorder.record(ThreadRecorder.java:120)

at com.android.build.gradle.BasePlugin.lambda$createTasks$1(BasePlugin.java:603)
BUILD FAILED
at org.gradle.internal.event.BroadcastDispatch$ActionInvocationHandler.dispatch(BroadcastDispatch.java:93)

at org.gradle.internal.event.BroadcastDispatch$ActionInvocationHandler.dispatch(BroadcastDispatch.java:82)
Total time: 2.863 secs
at org.gradle.internal.event.AbstractBroadcastDispatch.dispatch(AbstractBroadcastDispatch.java:44)
at org.gradle.internal.event.BroadcastDispatch.dispatch(BroadcastDispatch.java:79)
at org.gradle.internal.event.BroadcastDispatch.dispatch(BroadcastDispatch.java:30)
at org.gradle.internal.dispatch.ProxyDispatchAdapter$DispatchingInvocationHandler.invoke(ProxyDispatchAdapter.java:93)
at com.sun.proxy.$Proxy16.afterEvaluate(Unknown Source)
at org.gradle.configuration.project.LifecycleProjectEvaluator.notifyAfterEvaluate(LifecycleProjectEvaluator.java:82)
at org.gradle.configuration.project.LifecycleProjectEvaluator.doConfigure(LifecycleProjectEvaluator.java:76)
at org.gradle.configuration.project.LifecycleProjectEvaluator.access$000(LifecycleProjectEvaluator.java:33)
at org.gradle.configuration.project.LifecycleProjectEvaluator$1.execute(LifecycleProjectEvaluator.java:53)
at org.gradle.configuration.project.LifecycleProjectEvaluator$1.execute(LifecycleProjectEvaluator.java:50)
at org.gradle.internal.Transformers$4.transform(Transformers.java:169)
at org.gradle.internal.progress.DefaultBuildOperationExecutor.run(DefaultBuildOperationExecutor.java:106)
at org.gradle.internal.progress.DefaultBuildOperationExecutor.run(DefaultBuildOperationExecutor.java:61)
at org.gradle.configuration.project.LifecycleProjectEvaluator.evaluate(LifecycleProjectEvaluator.java:50)
at org.gradle.api.internal.project.DefaultProject.evaluate(DefaultProject.java:628)
at org.gradle.api.internal.project.DefaultProject.evaluate(DefaultProject.java:129)
at org.gradle.execution.TaskPathProjectEvaluator.configure(TaskPathProjectEvaluator.java:35)
at org.gradle.execution.TaskPathProjectEvaluator.configureHierarchy(TaskPathProjectEvaluator.java:60)
at org.gradle.configuration.DefaultBuildConfigurer.configure(DefaultBuildConfigurer.java:38)
at org.gradle.initialization.DefaultGradleLauncher$1.execute(DefaultGradleLauncher.java:161)
at org.gradle.initialization.DefaultGradleLauncher$1.execute(DefaultGradleLauncher.java:158)
at org.gradle.internal.Transformers$4.transform(Transformers.java:169)
at org.gradle.internal.progress.DefaultBuildOperationExecutor.run(DefaultBuildOperationExecutor.java:106)
at org.gradle.internal.progress.DefaultBuildOperationExecutor.run(DefaultBuildOperationExecutor.java:56)
at org.gradle.initialization.DefaultGradleLauncher.doBuildStages(DefaultGradleLauncher.java:158)
at org.gradle.initialization.DefaultGradleLauncher.doBuild(DefaultGradleLauncher.java:119)
at org.gradle.initialization.DefaultGradleLauncher.run(DefaultGradleLauncher.java:102)
at org.gradle.launcher.exec.GradleBuildController.run(GradleBuildController.java:71)
at org.gradle.tooling.internal.provider.ExecuteBuildActionRunner.run(ExecuteBuildActionRunner.java:28)
at org.gradle.launcher.exec.ChainingBuildActionRunner.run(ChainingBuildActionRunner.java:35)
at org.gradle.launcher.exec.InProcessBuildActionExecuter.execute(InProcessBuildActionExecuter.java:41)
at org.gradle.launcher.exec.InProcessBuildActionExecuter.execute(InProcessBuildActionExecuter.java:26)
at org.gradle.tooling.internal.provider.ContinuousBuildActionExecuter.execute(ContinuousBuildActionExecuter.java:75)
at org.gradle.tooling.internal.provider.ContinuousBuildActionExecuter.execute(ContinuousBuildActionExecuter.java:49)
at org.gradle.tooling.internal.provider.ServicesSetupBuildActionExecuter.execute(ServicesSetupBuildActionExecuter.java:44)
at org.gradle.tooling.internal.provider.ServicesSetupBuildActionExecuter.execute(ServicesSetupBuildActionExecuter.java:29)
at org.gradle.launcher.daemon.server.exec.ExecuteBuild.doBuild(ExecuteBuild.java:67)
at org.gradle.launcher.daemon.server.exec.BuildCommandOnly.execute(BuildCommandOnly.java:36)
at org.gradle.launcher.daemon.server.api.DaemonCommandExecution.proceed(DaemonCommandExecution.java:120)
at org.gradle.launcher.daemon.server.exec.WatchForDisconnection.execute(WatchForDisconnection.java:47)
at org.gradle.launcher.daemon.server.api.DaemonCommandExecution.proceed(DaemonCommandExecution.java:120)
at org.gradle.launcher.daemon.server.exec.ResetDeprecationLogger.execute(ResetDeprecationLogger.java:26)
at org.gradle.launcher.daemon.server.api.DaemonCommandExecution.proceed(DaemonCommandExecution.java:120)
at org.gradle.launcher.daemon.server.exec.RequestStopIfSingleUsedDaemon.execute(RequestStopIfSingleUsedDaemon.java:34)
at org.gradle.launcher.daemon.server.api.DaemonCommandExecution.proceed(DaemonCommandExecution.java:120)
at org.gradle.launcher.daemon.server.exec.ForwardClientInput$2.call(ForwardClientInput.java:74)
at org.gradle.launcher.daemon.server.exec.ForwardClientInput$2.call(ForwardClientInput.java:72)
at org.gradle.util.Swapper.swap(Swapper.java:38)
at org.gradle.launcher.daemon.server.exec.ForwardClientInput.execute(ForwardClientInput.java:72)
at org.gradle.launcher.daemon.server.api.DaemonCommandExecution.proceed(DaemonCommandExecution.java:120)
at org.gradle.launcher.daemon.server.exec.LogAndCheckHealth.execute(LogAndCheckHealth.java:55)
at org.gradle.launcher.daemon.server.api.DaemonCommandExecution.proceed(DaemonCommandExecution.java:120)
at org.gradle.launcher.daemon.server.exec.LogToClient.doBuild(LogToClient.java:60)
at org.gradle.launcher.daemon.server.exec.BuildCommandOnly.execute(BuildCommandOnly.java:36)
at org.gradle.launcher.daemon.server.api.DaemonCommandExecution.proceed(DaemonCommandExecution.java:120)
at org.gradle.launcher.daemon.server.exec.EstablishBuildEnvironment.doBuild(EstablishBuildEnvironment.java:72)
at org.gradle.launcher.daemon.server.exec.BuildCommandOnly.execute(BuildCommandOnly.java:36)
at org.gradle.launcher.daemon.server.api.DaemonCommandExecution.proceed(DaemonCommandExecution.java:120)
at org.gradle.launcher.daemon.server.exec.StartBuildOrRespondWithBusy$1.run(StartBuildOrRespondWithBusy.java:50)
at org.gradle.launcher.daemon.server.DaemonStateCoordinator$1.run(DaemonStateCoordinator.java:297)
at org.gradle.internal.concurrent.ExecutorPolicy$CatchAndRecordFailures.onExecute(ExecutorPolicy.java:54)
at org.gradle.internal.concurrent.StoppableExecutorImpl$1.run(StoppableExecutorImpl.java:40)
at java.util.concurrent.ThreadPoolExecutor.runWorker(ThreadPoolExecutor.java:1149)
at java.util.concurrent.ThreadPoolExecutor$Worker.run(ThreadPoolExecutor.java:624)
at java.lang.Thread.run(Thread.java:748)

FAILURE: Build failed with an exception.

* Where:
Script 'D:\Construct 2\learn\Carzy Math\platforms\android\CordovaLib\cordova.gradle' line: 64

* What went wrong:
A problem occurred evaluating root project 'android'.
> No installed build tools found. Install the Android build tools version 19.1.0 or higher.

* Try:
Run with --stacktrace option to get the stack trace. Run with --info or --debug option to get more log output.
Error: cmd: Command failed with exit code 1 Error output:
Failed to notify ProjectEvaluationListener.afterEvaluate(), but primary configuration failure takes precedence.
java.lang.IllegalStateException: buildToolsVersion is not specified.
at com.google.common.base.Preconditions.checkState(Preconditions.java:173)
at com.android.build.gradle.BasePlugin.createAndroidTasks(BasePlugin.java:645)
at com.android.build.gradle.BasePlugin$10.call(BasePlugin.java:608)
at com.android.build.gradle.BasePlugin$10.call(BasePlugin.java:605)
at com.android.builder.profile.ThreadRecorder.record(ThreadRecorder.java:156)
at com.android.builder.profile.ThreadRecorder.record(ThreadRecorder.java:120)
at com.android.build.gradle.BasePlugin.lambda$createTasks$1(BasePlugin.java:603)
at org.gradle.internal.event.BroadcastDispatch$ActionInvocationHandler.dispatch(BroadcastDispatch.java:93)
at org.gradle.internal.event.BroadcastDispatch$ActionInvocationHandler.dispatch(BroadcastDispatch.java:82)
at org.gradle.internal.event.AbstractBroadcastDispatch.dispatch(AbstractBroadcastDispatch.java:44)
at org.gradle.internal.event.BroadcastDispatch.dispatch(BroadcastDispatch.java:79)
at org.gradle.internal.event.BroadcastDispatch.dispatch(BroadcastDispatch.java:30)
at org.gradle.internal.dispatch.ProxyDispatchAdapter$DispatchingInvocationHandler.invoke(ProxyDispatchAdapter.java:93)
at com.sun.proxy.$Proxy16.afterEvaluate(Unknown Source)
at org.gradle.configuration.project.LifecycleProjectEvaluator.notifyAfterEvaluate(LifecycleProjectEvaluator.java:82)
at org.gradle.configuration.project.LifecycleProjectEvaluator.doConfigure(LifecycleProjectEvaluator.java:76)
at org.gradle.configuration.project.LifecycleProjectEvaluator.access$000(LifecycleProjectEvaluator.java:33)
at org.gradle.configuration.project.LifecycleProjectEvaluator$1.execute(LifecycleProjectEvaluator.java:53)
at org.gradle.configuration.project.LifecycleProjectEvaluator$1.execute(LifecycleProjectEvaluator.java:50)
at org.gradle.internal.Transformers$4.transform(Transformers.java:169)
at org.gradle.internal.progress.DefaultBuildOperationExecutor.run(DefaultBuildOperationExecutor.java:106)
at org.gradle.internal.progress.DefaultBuildOperationExecutor.run(DefaultBuildOperationExecutor.java:61)
at org.gradle.configuration.project.LifecycleProjectEvaluator.evaluate(LifecycleProjectEvaluator.java:50)
at org.gradle.api.internal.project.DefaultProject.evaluate(DefaultProject.java:628)
at org.gradle.api.internal.project.DefaultProject.evaluate(DefaultProject.java:129)
at org.gradle.execution.TaskPathProjectEvaluator.configure(TaskPathProjectEvaluator.java:35)
at org.gradle.execution.TaskPathProjectEvaluator.configureHierarchy(TaskPathProjectEvaluator.java:60)
at org.gradle.configuration.DefaultBuildConfigurer.configure(DefaultBuildConfigurer.java:38)
at org.gradle.initialization.DefaultGradleLauncher$1.execute(DefaultGradleLauncher.java:161)
at org.gradle.initialization.DefaultGradleLauncher$1.execute(DefaultGradleLauncher.java:158)
at org.gradle.internal.Transformers$4.transform(Transformers.java:169)

at org.gradle.internal.progress.DefaultBuildOperationExecutor.run(DefaultBuildOperationExecutor.java:106)
at org.gradle.internal.progress.DefaultBuildOperationExecutor.run(DefaultBuildOperationExecutor.java:56)
at org.gradle.initialization.DefaultGradleLauncher.doBuildStages(DefaultGradleLauncher.java:158)
at org.gradle.initialization.DefaultGradleLauncher.doBuild(DefaultGradleLauncher.java:119)
at org.gradle.initialization.DefaultGradleLauncher.run(DefaultGradleLauncher.java:102)
at org.gradle.launcher.exec.GradleBuildController.run(GradleBuildController.java:71)
at org.gradle.tooling.internal.provider.ExecuteBuildActionRunner.run(ExecuteBuildActionRunner.java:28)
at org.gradle.launcher.exec.ChainingBuildActionRunner.run(ChainingBuildActionRunner.java:35)
at org.gradle.launcher.exec.InProcessBuildActionExecuter.execute(InProcessBuildActionExecuter.java:41)
at org.gradle.launcher.exec.InProcessBuildActionExecuter.execute(InProcessBuildActionExecuter.java:26)
at org.gradle.tooling.internal.provider.ContinuousBuildActionExecuter.execute(ContinuousBuildActionExecuter.java:75)
at org.gradle.tooling.internal.provider.ContinuousBuildActionExecuter.execute(ContinuousBuildActionExecuter.java:49)
at org.gradle.tooling.internal.provider.ServicesSetupBuildActionExecuter.execute(ServicesSetupBuildActionExecuter.java:44)
at org.gradle.tooling.internal.provider.ServicesSetupBuildActionExecuter.execute(ServicesSetupBuildActionExecuter.java:29)
at org.gradle.launcher.daemon.server.exec.ExecuteBuild.doBuild(ExecuteBuild.java:67)
at org.gradle.launcher.daemon.server.exec.BuildCommandOnly.execute(BuildCommandOnly.java:36)
at org.gradle.launcher.daemon.server.api.DaemonCommandExecution.proceed(DaemonCommandExecution.java:120)
at org.gradle.launcher.daemon.server.exec.WatchForDisconnection.execute(WatchForDisconnection.java:47)
at org.gradle.launcher.daemon.server.api.DaemonCommandExecution.proceed(DaemonCommandExecution.java:120)
at org.gradle.launcher.daemon.server.exec.ResetDeprecationLogger.execute(ResetDeprecationLogger.java:26)
at org.gradle.launcher.daemon.server.api.DaemonCommandExecution.proceed(DaemonCommandExecution.java:120)
at org.gradle.launcher.daemon.server.exec.RequestStopIfSingleUsedDaemon.execute(RequestStopIfSingleUsedDaemon.java:34)
at org.gradle.launcher.daemon.server.api.DaemonCommandExecution.proceed(DaemonCommandExecution.java:120)
at org.gradle.launcher.daemon.server.exec.ForwardClientInput$2.call(ForwardClientInput.java:74)
at org.gradle.launcher.daemon.server.exec.ForwardClientInput$2.call(ForwardClientInput.java:72)
at org.gradle.util.Swapper.swap(Swapper.java:38)
at org.gradle.launcher.daemon.server.exec.ForwardClientInput.execute(ForwardClientInput.java:72)
at org.gradle.launcher.daemon.server.api.DaemonCommandExecution.proceed(DaemonCommandExecution.java:120)
at org.gradle.launcher.daemon.server.exec.LogAndCheckHealth.execute(LogAndCheckHealth.java:55)
at org.gradle.launcher.daemon.server.api.DaemonCommandExecution.proceed(DaemonCommandExecution.java:120)
at org.gradle.launcher.daemon.server.exec.LogToClient.doBuild(LogToClient.java:60)
at org.gradle.launcher.daemon.server.exec.BuildCommandOnly.execute(BuildCommandOnly.java:36)
at org.gradle.launcher.daemon.server.api.DaemonCommandExecution.proceed(DaemonCommandExecution.java:120)
at org.gradle.launcher.daemon.server.exec.EstablishBuildEnvironment.doBuild(EstablishBuildEnvironment.java:72)
at org.gradle.launcher.daemon.server.exec.BuildCommandOnly.execute(BuildCommandOnly.java:36)
at org.gradle.launcher.daemon.server.api.DaemonCommandExecution.proceed(DaemonCommandExecution.java:120)
at org.gradle.launcher.daemon.server.exec.StartBuildOrRespondWithBusy$1.run(StartBuildOrRespondWithBusy.java:50)
at org.gradle.launcher.daemon.server.DaemonStateCoordinator$1.run(DaemonStateCoordinator.java:297)
at org.gradle.internal.concurrent.ExecutorPolicy$CatchAndRecordFailures.onExecute(ExecutorPolicy.java:54)
at org.gradle.internal.concurrent.StoppableExecutorImpl$1.run(StoppableExecutorImpl.java:40)
at java.util.concurrent.ThreadPoolExecutor.runWorker(ThreadPoolExecutor.java:1149)
at java.util.concurrent.ThreadPoolExecutor$Worker.run(ThreadPoolExecutor.java:624)
at java.lang.Thread.run(Thread.java:748)

FAILURE: Build failed with an exception.

* Where:
Script 'D:\Construct 2\learn\Carzy Math\platforms\android\CordovaLib\cordova.gradle' line: 64

* What went wrong:
A problem occurred evaluating root project 'android'.
> No installed build tools found. Install the Android build tools version 19.1.0 or higher.

* Try:
Run with --stacktrace option to get the stack trace. Run with --info or --debug option to get more log output.
Picked up _JAVA_OPTIONS: -Xmx2g



79 ________________________________ 79
 ||||     حمایت از تولید ملی با دانلود      ||||
||
/__\
/\
 ||||  بازی |ساخت ایران| بزودی...  ||||
----------------------------------------------------

 
پاسخ دهید
 سپاس شده توسط:
سلام
من jdk رو نصب کردم اما تو وینوس نصبش نمیاد توی قسمت Variable valueh هم %JAVA_HOME%\bin وارد کردم ولی درست نمیشه
کردووا رو هم نصب کردم اونم نصبش نیومد

 
پاسخ دهید
 سپاس شده توسط:
تو cmd چک کنید
البته من فکر میکنم پوشه ی bin رو نباید ادرس داد و فقط ادرس پوشه ی نصب جاوا را باید وارد کرد
در path باید ادرس پوشه یbin را وارد کرد.
إِنَّ مَعِيَ رَبّي سَيَهدينِ
قطعا خدا با من است و مرا راهنمایی خواهد کرد
 
پاسخ دهید
 سپاس شده توسط: arian
(1397/8/10، 02:43 عصر)مهدی بابایی نوشته: تو cmd چک کنید
البته من فکر میکنم پوشه ی bin رو نباید ادرس داد و فقط ادرس پوشه ی نصب جاوا را باید وارد کرد
در path باید ادرس پوشه یbin را وارد کرد.

می شه بگید دقیقا چی باید بنویسم تو Variable valueh واسه path ؟
 
پاسخ دهید
 سپاس شده توسط:
(1397/8/10، 07:29 عصر)arian نوشته:
(1397/8/10، 02:43 عصر)مهدی بابایی نوشته: تو cmd چک کنید
البته من فکر میکنم پوشه ی bin رو نباید ادرس داد و فقط ادرس پوشه ی نصب جاوا را باید وارد کرد
در path باید ادرس پوشه یbin را وارد کرد.

می شه بگید دقیقا چی باید بنویسم تو Variable valueh واسه path ؟

ابتدا این رو بزارید ؛
بعد ادرس پوشه ی bin. در پوشه ی محل نصب جاوا رو بزارید
إِنَّ مَعِيَ رَبّي سَيَهدينِ
قطعا خدا با من است و مرا راهنمایی خواهد کرد
 
پاسخ دهید
 سپاس شده توسط: arian
(1397/8/10، 08:39 عصر)مهدی بابایی نوشته:
(1397/8/10، 07:29 عصر)arian نوشته:
(1397/8/10، 02:43 عصر)مهدی بابایی نوشته: تو cmd چک کنید
البته من فکر میکنم پوشه ی bin رو نباید ادرس داد و فقط ادرس پوشه ی نصب جاوا را باید وارد کرد
در path باید ادرس پوشه یbin را وارد کرد.

می شه بگید دقیقا چی باید بنویسم تو Variable valueh واسه path ؟

ابتدا این رو بزارید ؛
بعد ادرس پوشه ی bin.  در پوشه ی محل نصب جاوا رو بزارید
همینو زدم ولی درست نشد[عکس: Untitled.jpg]
 
پاسخ دهید
 سپاس شده توسط:
با سلام ! من با وینوس بدون هیچ مشکلی خروجی میگیرم .
اما اینجاست که من version code رو روی هر مقداری ک بذارم ، در فایل apk نهایی تاثیری نداره و همیشه روی 10000 
تنظیم میشه . مثلا ورژن کد رو میزارم روی 99999 یا چند بار گذاشتم روی 1 یا 10001 اما همیشه 10000 ثبت میشه .
باید چیکار کنم ؟
الان بخوام برنامم رو آپدیت بدم ، مارکت میگه چون ورژن کدت افزایش پیدا نکرده ، نمیتونی آپدیت بدی .

با تشکر از همه
 
پاسخ دهید
 سپاس شده توسط:
یه فایل اضافی بود
بهتره پاک کنید.فکر میکنم config بود
إِنَّ مَعِيَ رَبّي سَيَهدينِ
قطعا خدا با من است و مرا راهنمایی خواهد کرد
 
پاسخ دهید
 سپاس شده توسط: shazde
(1397/8/13، 04:53 عصر)hiddendanger نوشته: با سلام ! من با وینوس بدون هیچ مشکلی خروجی میگیرم .
اما اینجاست که من version code رو روی هر مقداری ک بذارم ، در فایل apk نهایی تاثیری نداره و همیشه روی 10000 
تنظیم میشه . مثلا ورژن کد رو میزارم روی 99999 یا چند بار گذاشتم روی 1 یا 10001 اما همیشه 10000 ثبت میشه .
باید چیکار کنم ؟
الان بخوام برنامم رو آپدیت بدم ، مارکت میگه چون ورژن کدت افزایش پیدا نکرده ، نمیتونی آپدیت بدی .

با تشکر از همه

??????
 
پاسخ دهید
 سپاس شده توسط:
  


موضوعات مشابه ...
موضوع نویسنده پاسخ بازدید آخرین ارسال
  اسپرایت ساز جدید c2modeler c2modeler 4 871 1397/8/19، 04:52 عصر
آخرین ارسال: S.L.F
  اطلاعات از دیتابیس [email protected] 0 35 1397/8/13، 07:38 عصر
آخرین ارسال: [email protected]
  ساخت گروهی 365 بازی smrm 2 58 1397/8/9، 09:06 عصر
آخرین ارسال: kiarash
  انجین بازی سازیGDevelop مهدی بابایی 2 136 1397/8/5، 06:04 عصر
آخرین ارسال: مهدی بابایی
  آموزش خروجی آفلاین c2buildozer (مناسب برای تست) مهدی بابایی 16 578 1397/8/5، 05:16 عصر
آخرین ارسال: S.L.F

پرش به انجمن: