مهمان عزیز خوش‌آمدید. ورود عضــویت


وینوس - خروجی آفلاین اندروید
#21
(1396/11/1، 03:22 عصر)construct2j.blog.ir نوشته:
(1396/11/1، 03:20 عصر)miladesign نوشته:
(1396/11/1، 01:09 عصر)pro.designer_68 نوشته: سلام
با تشکر فراوان از آقا میلاد عزیز

چطوری میشه این پلاگین های گیت و یا پلاگین های دانلود شده رو نصب کرد من لینک رو توی قسمت پلاگین وارد میکنم و افزودن پلاگین رو میزنم ولی ارور میده
از قسمت فایل کانفیگ هم آدرس های پلاگین ها رو حذف میکنه.
چکار کنم؟؟

متن خطا رو بفرستید
سلام همه چیز نصب هست موقع خروجی این پیغام رو میده
(node:2924) UnhandledPromiseRejectionWarning: Unhandled promise rejection. This error originated either by throwing inside of an async function without a catch block, or by rejecting a promise which was not handled with .catch(). (rejection id: 1)

(node:2924) [DEP0018] DeprecationWarning: Unhandled promise rejections are deprecated. In the future, promise rejections that are not handled will terminate the Node.js process with a non-zero exit code.

سلام. فک میکنم متن خطا رو کامل کپی پیست نکردید، این قسمتا به نظرم خطای اصلی نیست. 
آپدیت: من کاراکتر غیر مجاز توی نام گذاشتم (&)، همین خطا رو گرفتم(البته شاید این خطا ، هر خطایی بتونه باشه، یعنی خطای تعریف نشده باشه، ولی بهر حال). مطمئن بشین نام فارسی نباشه یا کاراکتر غیر مجاز نداشته باشه.
 
 سپاس شده توسط: miladesign
#22
سعی کنید اسم پروژتون که توی برنامه میسازید فارسی نباشه.
 
 سپاس شده توسط: shazde ، SAMAN YKA
#23
برای من این ارور رو میده:


You have been opted out of telemetry. To change this, run: cordova telemetry on.
(node:13980) UnhandledPromiseRejectionWarning: Unhandled promise rejection (rejection id: 1): Error: cmd: Command failed with exit code 1 Error output:

npm ERR! Invalid package.json

npm ERR! A complete log of this run can be found in:
npm ERR!     C:\Users\sam\AppData\Roaming\npm-cache\_logs\2018-01-22T05_13_49_739Z-debug.log
(node:13980) [DEP0018] DeprecationWarning: Unhandled promise rejections are deprecated. In the future, promise rejections that are not handled will terminate the Node.js process with a non-zero exit code.


You have been opted out of telemetry. To change this, run: cordova telemetry on.
Removing platform android from config.xml file...



You have been opted out of telemetry. To change this, run: cordova telemetry on.
Using cordova-fetch for D:\Program\construct
(node:8044) UnhandledPromiseRejectionWarning: Unhandled promise rejection (rejection id: 1): CordovaError: Failed to fetch platform D:\Program\construct

Probably this is either a connection problem, or platform spec is incorrect.
Check your connection and platform name/version/URL.
Error: cmd: Command failed with exit code 1 Error output:
npm ERR! code ENOLOCAL
npm ERR! Could not install from "D:\Program\construct" as it does not contain a package.json file.

npm ERR! A complete log of this run can be found in:
npm ERR!     C:\Users\sam\AppData\Roaming\npm-cache\_logs\2018-01-22T05_14_11_290Z-debug.log
(node:8044) [DEP0018] DeprecationWarning: Unhandled promise rejections are deprecated. In the future, promise rejections that are not handled will terminate the Node.js process with a non-zero exit code.

این آدرس جایی هست که وینوس نصب:
"D:\Program\construct"
 
 سپاس شده توسط:
#24
مشخصات سیستمتون رو بفرستید
 
 سپاس شده توسط:
#25
(1396/11/2، 10:00 صبح)miladesign نوشته: مشخصات سیستمتون رو بفرستید

win 10 x64
cpu core i7
ram 8 gig
geforce gt 630m 2 gig
 
 سپاس شده توسط:
#26
(1396/11/1، 02:45 عصر)construct2j.blog.ir نوشته:
(1396/10/30، 07:58 عصر)miladesign نوشته:
(1396/10/30، 07:45 عصر)construct2j.blog.ir نوشته: کوردوا چی چجوری نصب کنم وقتی نصب میزنم هیچ اتفاقی نمی افته

کافیه cmd رو باز کنی و دستور زیر رو اجرا کنی:
کد:
npm install -g cordova

حتما باید node.js نصب باشه تا این دستور اجرا بشه

(1396/10/30، 07:38 عصر)محمد 82 نوشته: انجام دادم ولی بازم نمیاره

باید بشه.
به هر دوتا PATH بالا و پایین اضافه کنید.
یدونه GRADLE_HOME هم باید توی بالاییا باشه
مشکل حل شد.


(1396/10/30، 07:23 عصر)miladesign نوشته: بعد از اینکه گرادل رو نصب کردید این کار رو انجام بدید:

1. 
[عکس: gradle-tutorial-1.png]

2.
[عکس: gradle-tutorial-2.png]

3.
[عکس: gradle-tutorial-3.png]

4. 
[عکس: gradle-tutorial-7-new.png]

5.
[عکس: gradle-tutorial-8.png]

6. به آخر آن علامت ; اضافه کنید:
[عکس: gradle-tutorial-9.png]

7. آدرس پوشه bin از محل نصب گرادل را به آخر آن اضافه کنید و OK را بزنید. (مثلا C:\gradle-2.1\bin)
مشکل گرادل حل شد.

میشه برا کوردوا هم همینطوری توضیح بدید که چیکار باید بکنیم؟
 
 سپاس شده توسط:
#27
(1396/10/30، 07:58 عصر)miladesign نوشته:
(1396/10/30، 07:45 عصر)construct2j.blog.ir نوشته: کوردوا چی چجوری نصب کنم وقتی نصب میزنم هیچ اتفاقی نمی افته

کافیه cmd رو باز کنی و دستور زیر رو اجرا کنی:
کد:
npm install -g cordova

حتما باید node.js نصب باشه تا این دستور اجرا بشه

(1396/10/30، 07:38 عصر)محمد 82 نوشته: انجام دادم ولی بازم نمیاره

باید بشه.
به هر دوتا PATH بالا و پایین اضافه کنید.
یدونه GRADLE_HOME هم باید توی بالاییا باشه
بالا جواب سوال نصب کوردوا است
 
 سپاس شده توسط:
#28
اقا کلا برنامش مشکل داره . همه چیز نصبه ، باز میای خروجی بگیری هر دفعه یه ارور میده
استودیو بازیسازی ایروید  3
بازی های منتشر شده در بازار : مهمات ، قالیچه ، مبارک ، 1357 و ارتش سياه و شهاب بدو و شهرزاد
[عکس: photo_2017_11_18_00_26_16.jpg]
 
 سپاس شده توسط:
#29
آقا میلاد واسه من ارور درباره درست کار نکردن فایل croswalk و android .tgz میده چیکار کنم 
 
 سپاس شده توسط:
#30
*
********** BUILD STARTED AT 2018/01/23 143746 **********
*

Using cordova-fetch for H:\Vinoos-1.1.0\Vinoos\Data\Android.tgz
Adding android project...
Creating Cordova project for the Android platform:
    Path: platforms\android
    Package: com.example.vinoos
    Name: Vinoos
    Activity: MainActivity
    Android target: android-25
Subproject Path: CordovaLib
Android project created with [email protected]
--save flag or autosave detected
Saving [email protected]~6.1.2 into config.xml file ...


ANDROID_HOME=C:\Users\User1\AppData\Local\Android\android-sdk
JAVA_HOME=C:\Program Files\java\jdk1.8.0_152
Subproject Path: CordovaLib
Downloading https://services.gradle.org/distribution....1-all.zip
...........................................................................................................................................................................................................................................................................................................................................................................................................................................................................................................................................................................................................................................................................................................................................................................................................................................................................................................................................................................................................................................................................................................................................................................................................................................................................................................................................................................................................................................................................................................................................................................................................................................................................................................................................................................................................................................................................................................................................................................................................................................................................................................................................................................................................................................................................................................................................................................................................................................................................................................................................................................................................................................................................................................................................................................................................................................................................................................................................................................................................................................................................................................................................................................................................................................................................................................................................................................................................................................................................................................................................................................................
Unzipping C:\Users\User1\.gradle\wrapper\dists\gradle-2.14.1-all\4cj8p00t3e5ni9e8iofg8ghvk7\gradle-2.14.1-all.zip to C:\Users\User1\.gradle\wrapper\dists\gradle-2.14.1-all\4cj8p00t3e5ni9e8iofg8ghvk7
Starting a new Gradle Daemon for this build (subsequent builds will be faster).

FAILURE: Build failed with an exception.

* What went wrong:
Unable to start the daemon process.
This problem might be caused by incorrect configuration of the daemon.
For example, an unrecognized jvm option is used.
Please refer to the user guide chapter on the daemon at https://docs.gradle.org/2.14.1/userguide...aemon.html
Please read the following process output to find out more:
-----------------------
Error occurred during initialization of VM
Could not reserve enough space for 2097152KB object heap


* Try:
Run with --stacktrace option to get the stack trace. Run with --info or --debug option to get more log output.
(node:5400) UnhandledPromiseRejectionWarning: Unhandled promise rejection (rejection id: 1): Error: cmd: Command failed with exit code 1 Error output:
FAILURE: Build failed with an exception.

* What went wrong:
Unable to start the daemon process.
This problem might be caused by incorrect configuration of the daemon.
For example, an unrecognized jvm option is used.
Please refer to the user guide chapter on the daemon at https://docs.gradle.org/2.14.1/userguide...aemon.html
Please read the following process output to find out more:
-----------------------
Error occurred during initialization of VM
Could not reserve enough space for 2097152KB object heap


* Try:
Run with --stacktrace option to get the stack trace. Run with --info or --debug option to get more log output.
(node:5400) [DEP0018] DeprecationWarning: Unhandled promise rejections are deprecated. In the future, promise rejections that are not handled will terminate the Node.js process with a non-zero exit code.


آقا میلاد برا من هم این اشکال رو میده؟؟ 63 63 63


 
 سپاس شده توسط:
  


موضوعات مشابه ...
موضوع نویسنده پاسخ بازدید آخرین ارسال
Smile پس زمینه سفینه فضایی amin COD 5 128 1397/4/1، 10:50 عصر
آخرین ارسال: amin COD
  سورس بازی کامل جعبه ها mohsen_nasri 0 114 1397/3/25، 02:24 عصر
آخرین ارسال: mohsen_nasri
  سورس بازی سقوط آزاد mohsen_nasri 0 125 1397/3/24، 06:31 عصر
آخرین ارسال: mohsen_nasri
  تبلیغات تپسل محمد 82 0 134 1397/3/5، 07:33 عصر
آخرین ارسال: محمد 82
  پکیج عالی اسپرایت soft79 0 174 1397/1/23، 11:17 صبح
آخرین ارسال: soft79

پرش به انجمن: