مهمان عزیز خوش‌آمدید. ورود عضــویت


وینوس - خروجی آفلاین اندروید
ارور
Not A Valid Win32 Application
 
پاسخ دهید
 سپاس شده توسط:
سلام
وقتی میخوام خروجی بگیرم این فایل رو باز میکنه[عکس: Untitled.png]
بعد که فایل رو میبندم وینوس ادامه میده و چند بار دیگه این فایل رو باز میکنه
و در آخر بدون هیچ خطایی مینویسه کامپایل انجام نشد[عکس: Untitled.png]
بازی ها قدرتمند ترین منابع آموزشین

پس چرا ما فقط برای سرگرمی بازی میسازیم
 
پاسخ دهید
 سپاس شده توسط:
(1398/1/26، 06:26 عصر)پیشنهmahdikmnh نوشته: سلام
وقتی میخوام خروجی بگیرم این فایل رو باز میکنه[عکس: Untitled.png]
بعد که فایل رو میبندم وینوس ادامه میده و چند بار دیگه این فایل رو باز میکنه
و در آخر بدون هیچ خطایی مینویسه کامپایل انجام نشد[عکس: Untitled.png]

پیشنهاد میکنم از پکیج زیر استفاده کنید

http://construct2.ir/showthread.php?tid=...3#pid40843

کامل و بدون نیاز به نصب پیش نیاز های وینوس

(1397/12/12، 12:46 عصر)maadking نوشته: ارور جدیدی برخوردم! کسی اطلاع داره کمک کنه
کد:
`
*
********** BUILD STARTED AT 2019/02/28 08:47:38 **********
*

Removing platform android from config.xml file...

Adding android project...
Creating Cordova project for the Android platform:
Path: platforms\android
Package: com.gpars.char
Name: ch
Activity: MainActivity
Android target: android-25
Subproject Path: CordovaLib
Android project created with [email protected]
--save flag or autosave detected
Saving [email protected]:\Vinoos\Data\platforms\6.2.3.tgz into config.xml file ...

ANDROID_HOME=C:\AndroidSDK
JAVA_HOME=C:\Program Files\Java\jdk1.8.0_172
:wrapper

BUILD SUCCESSFUL

Total time: 6.047 secs
Picked up _JAVA_OPTIONS: -Xmx2g
Subproject Path: CordovaLib
The Task.leftShift(Closure) method has been deprecated and is scheduled to be removed in Gradle 5.0. Please use Task.doLast(Action) instead.
at build_1q9vqdvuhj05ozb20my6nlql3.run(C:\Users\pedram\Documents\Vinoos\Projects\chh\platforms\android\build.gradle:137)
The JavaCompile.setDependencyCacheDir() method has been deprecated and is scheduled to be removed in Gradle 4.0.
Incremental java compilation is an incubating feature.
The TaskInputs.source(Object) method has been deprecated and is scheduled to be removed in Gradle 4.0. Please use TaskInputs.file(Object).skipWhenEmpty() instead.
The ProjectDependency.getProjectConfiguration() method has been deprecated and is scheduled to be removed in Gradle 4.0.
ModuleDependency.getConfiguration() has been deprecated and is scheduled to be removed in Gradle 4.0. Use ModuleDependency.getTargetConfiguration() instead.
:preBuild UP-TO-DATE
:preDebugBuild UP-TO-DATE
:checkDebugManifest
:CordovaLib:preBuild UP-TO-DATE
:CordovaLib:preDebugBuild UP-TO-DATE
:CordovaLib:checkDebugManifest
:CordovaLib:prepareDebugDependencies
:CordovaLib:compileDebugAidl
:CordovaLib:compileDebugNdk UP-TO-DATE
:CordovaLib:compileLint
:CordovaLib:copyDebugLint UP-TO-DATE
:CordovaLib:mergeDebugShaders
:CordovaLib:compileDebugShaders
:CordovaLib:generateDebugAssets
:CordovaLib:mergeDebugAssets
:CordovaLib:mergeDebugProguardFiles
:CordovaLib:packageDebugRenderscript UP-TO-DATE
:CordovaLib:compileDebugRenderscript
:CordovaLib:generateDebugResValues
:CordovaLib:generateDebugResources
:CordovaLib:packageDebugResources
:CordovaLib:processDebugManifest
:CordovaLib:generateDebugBuildConfig
:CordovaLib:processDebugResources
:CordovaLib:generateDebugSources
:CordovaLib:incrementalDebugJavaCompilationSafeguard
:CordovaLib:compileDebugJavaWithJavac
:CordovaLib:compileDebugJavaWithJavac - is not incremental (e.g. outputs have changed, no previous execution, etc.).
Note: Some input files use or override a deprecated API.
:CordovaLib:processDebugJavaRes UP-TO-DATE
Note: Recompile with -Xlint:deprecation for details.
:CordovaLib:transformResourcesWithMergeJavaResForDebug
:CordovaLib:transformClassesAndResourcesWithSyncLibJarsForDebug
:CordovaLib:mergeDebugJniLibFolders
:CordovaLib:transformNative_libsWithMergeJniLibsForDebug
:CordovaLib:transformNative_libsWithSyncJniLibsForDebug
:CordovaLib:bundleDebug
:prepareOrgApacheCordovaCordovaLib623DebugLibrary
:prepareDebugDependencies
:compileDebugAidl
:compileDebugRenderscript
:generateDebugBuildConfig
:generateDebugResValues
:generateDebugResources
:mergeDebugResources
:processDebugManifest
:processDebugResources
:generateDebugSources
:incrementalDebugJavaCompilationSafeguard
:compileDebugJavaWithJavac
:compileDebugJavaWithJavac - is not incremental (e.g. outputs have changed, no previous execution, etc.).
C:\Users\pedram\Documents\Vinoos\Projects\chh\platforms\android\src\com\gpars\char\MainActivity.java:20: error: expected
:compileDebugJavaWithJavac FAILED
package com.gpars.char;

             ^

BUILD FAILED
C:\Users\pedram\Documents\Vinoos\Projects\chh\platforms\android\build\generated\source\r\debug\com\gpars\char\R.java:8: error: expected

package com.gpars.char;
Total time: 7.939 secs
^
C:\Users\pedram\Documents\Vinoos\Projects\chh\platforms\android\build\generated\source\buildConfig\debug\com\gpars\char\BuildConfig.java:4: error: expected
package com.gpars.char;
^
3 errors

FAILURE: Build failed with an exception.

   What went wrong:
   Execution failed for task ':compileDebugJavaWithJavac'.

   Compilation failed; see the compiler error output for details.

   Try:
   Run with --stacktrace option to get the stack trace. Run with --info or --debug option to get more log output.
   Error: cmd: Command failed with exit code 1 Error output:
   Note: Some input files use or override a deprecated API.
   Note: Recompile with -Xlint:deprecation for details.
   C:\Users\pedram\Documents\Vinoos\Projects\chh\platforms\android\src\com\gpars\char\MainActivity.java:20: error: expected

package com.gpars.char;
^
C:\Users\pedram\Documents\Vinoos\Projects\chh\platforms\android\build\generated\source\r\debug\com\gpars\char\R.java:8: error: expected
package com.gpars.char;
^
C:\Users\pedram\Documents\Vinoos\Projects\chh\platforms\android\build\generated\source\buildConfig\debug\com\gpars\char\BuildConfig.java:4: error: expected
package com.gpars.char;
^
3 errors

FAILURE: Build failed with an exception.

   What went wrong:
   Execution failed for task ':compileDebugJavaWithJavac'.

   Compilation failed; see the compiler error output for details.

   Try:
   Run with --stacktrace option to get the stack trace. Run with --info or --debug option to get more log output.
   Picked up _JAVA_OPTIONS: -Xmx2g

`

سلام اگر میتونید که پکیج زیر رو دریافت کنید
http://construct2.ir/showthread.php?tid=...3#pid40843

یا نه پکیج نام بازی تون رو تغییر بدید درست میشه فک کنم
 
پاسخ دهید
 سپاس شده توسط:
سلام
من بازیمو تست میکنم مشکل نداره ولی وقتی منتشر میکنم تو اندروید 8 خطا میده

برنامه پس از اجرا Force close می شود. گزارش logcat ضمیمه این پیغام در پنل شده است. لطفا مورد را برطرف نمایید. دستگاه تست: Galaxy J5 Pro 2017 – J530F – Android 8.1.0 – API27


عکس خطا در ایران اپس

 
پاسخ دهید
 سپاس شده توسط:
(1398/1/29، 05:00 عصر)hb1221 نوشته: سلام
من بازیمو تست میکنم مشکل نداره ولی وقتی منتشر میکنم تو اندروید 8 خطا میده

برنامه پس از اجرا Force close می شود. گزارش logcat ضمیمه این پیغام در پنل شده است. لطفا مورد را برطرف نمایید. دستگاه تست: Galaxy J5 Pro 2017 – J530F – Android 8.1.0 – API27


عکس خطا در ایران اپس

سلام 
مشکل شما برای اندروید استودیو هست.اینجا انجمن حل مشکلات کانستراکت هست
برای رفع مشکل میتونید از انجمن زیر کمک بگیرید
https://programchi.ir/

ولی پیشنهاد میکنم api 26 رو تست کنید.
 
پاسخ دهید
 سپاس شده توسط:
برنامه رو با کانستراکت ساختم و با وینوس خروجی گرفتم اندروید استودیو بلد نیستم
api26 رو تو sdk دارم چیکارش کنم target sdk قرار بدم
توی خطاها تبلیغات ad-sdk قرمز شده باید حذف بشه یا مشکل از چیز دیگه هست


 
پاسخ دهید
 سپاس شده توسط:
کد:
این خطا یعنی چی ؟
چطور میتونم حلش کنم ؟
*
********** BUILD STARTED AT 2019/04/19 14:22:50 **********
*


You have been opted out of telemetry. To change this, run: cordova telemetry on.



You have been opted out of telemetry. To change this, run: cordova telemetry on.
Adding android project...
Creating Cordova project for the Android platform:
    Path: platforms\android
    Package: ir.user.we
    Name: we_were_bad
    Activity: MainActivity
    Android target: android-25
Subproject Path: CordovaLib
Android project created with [email protected]
Installing "vinoos-canvasplus" for android
Subproject Path: CordovaLib
--save flag or autosave detected
Saving [email protected]:\pack_vinoos\pack_vinoos\vinoos\Data\platforms\6.2.3.tgz into config.xml file ...



You have been opted out of telemetry. To change this, run: cordova telemetry on.
ANDROID_HOME=E:\pack_vinoos\pack_vinoos\sdkv
JAVA_HOME=E:\pack_vinoos\pack_vinoos\Java\jdk1.8.0_172
:wrapper

BUILD SUCCESSFUL

Total time: 9.32 secs
Subproject Path: CordovaLib
Downloading [url]https://services.gradle.org/distributions/gradle-3.3-all.zip[/url]

Exception in thread "main" java.net.UnknownHostException: services.gradle.org
    at java.net.AbstractPlainSocketImpl.connect(AbstractPlainSocketImpl.java:184)
    at java.net.PlainSocketImpl.connect(PlainSocketImpl.java:172)
    at java.net.SocksSocketImpl.connect(SocksSocketImpl.java:392)
    at java.net.Socket.connect(Socket.java:589)
    at sun.security.ssl.SSLSocketImpl.connect(SSLSocketImpl.java:673)

    at sun.security.ssl.BaseSSLSocketImpl.connect(BaseSSLSocketImpl.java:173)
    at sun.net.NetworkClient.doConnect(NetworkClient.java:180)
    at sun.net.www.http.HttpClient.openServer(HttpClient.java:463)
    at sun.net.www.http.HttpClient.openServer(HttpClient.java:558)
    at sun.net.www.protocol.https.HttpsClient.<init>(HttpsClient.java:264)
    at sun.net.www.protocol.https.HttpsClient.New(HttpsClient.java:367)
    at sun.net.www.protocol.https.AbstractDelegateHttpsURLConnection.getNewHttpClient(AbstractDelegateHttpsURLConnection.java:191)
    at sun.net.www.protocol.http.HttpURLConnection.plainConnect0(HttpURLConnection.java:1156)
    at sun.net.www.protocol.http.HttpURLConnection.plainConnect(HttpURLConnection.java:1050)
    at sun.net.www.protocol.https.AbstractDelegateHttpsURLConnection.connect(AbstractDelegateHttpsURLConnection.java:177)
    at sun.net.www.protocol.http.HttpURLConnection.getInputStream0(HttpURLConnection.java:1564)
    at sun.net.www.protocol.http.HttpURLConnection.getInputStream(HttpURLConnection.java:1492)
    at sun.net.www.protocol.https.HttpsURLConnectionImpl.getInputStream(HttpsURLConnectionImpl.java:263)
    at org.gradle.wrapper.Download.downloadInternal(Download.java:58)
    at org.gradle.wrapper.Download.download(Download.java:44)
    at org.gradle.wrapper.Install$1.call(Install.java:61)
    at org.gradle.wrapper.Install$1.call(Install.java:48)
    at org.gradle.wrapper.ExclusiveFileAccessManager.access(ExclusiveFileAccessManager.java:65)
    at org.gradle.wrapper.Install.createDist(Install.java:48)
    at org.gradle.wrapper.WrapperExecutor.execute(WrapperExecutor.java:128)
    at org.gradle.wrapper.GradleWrapperMain.main(GradleWrapperMain.java:61)
Error: cmd: Command failed with exit code 1 Error output:
Exception in thread "main" java.net.UnknownHostException: services.gradle.org
    at java.net.AbstractPlainSocketImpl.connect(AbstractPlainSocketImpl.java:184)
    at java.net.PlainSocketImpl.connect(PlainSocketImpl.java:172)
    at java.net.SocksSocketImpl.connect(SocksSocketImpl.java:392)
    at java.net.Socket.connect(Socket.java:589)
    at sun.security.ssl.SSLSocketImpl.connect(SSLSocketImpl.java:673)
    at sun.security.ssl.BaseSSLSocketImpl.connect(BaseSSLSocketImpl.java:173)
    at sun.net.NetworkClient.doConnect(NetworkClient.java:180)
    at sun.net.www.http.HttpClient.openServer(HttpClient.java:463)
    at sun.net.www.http.HttpClient.openServer(HttpClient.java:558)
    at sun.net.www.protocol.https.HttpsClient.<init>(HttpsClient.java:264)
    at sun.net.www.protocol.https.HttpsClient.New(HttpsClient.java:367)
    at sun.net.www.protocol.https.AbstractDelegateHttpsURLConnection.getNewHttpClient(AbstractDelegateHttpsURLConnection.java:191)
    at sun.net.www.protocol.http.HttpURLConnection.plainConnect0(HttpURLConnection.java:1156)
    at sun.net.www.protocol.http.HttpURLConnection.plainConnect(HttpURLConnection.java:1050)
    at sun.net.www.protocol.https.AbstractDelegateHttpsURLConnection.connect(AbstractDelegateHttpsURLConnection.java:177)
    at sun.net.www.protocol.http.HttpURLConnection.getInputStream0(HttpURLConnection.java:1564)
    at sun.net.www.protocol.http.HttpURLConnection.getInputStream(HttpURLConnection.java:1492)
    at sun.net.www.protocol.https.HttpsURLConnectionImpl.getInputStream(HttpsURLConnectionImpl.java:263)
    at org.gradle.wrapper.Download.downloadInternal(Download.java:58)
    at org.gradle.wrapper.Download.download(Download.java:44)
    at org.gradle.wrapper.Install$1.call(Install.java:61)
    at org.gradle.wrapper.Install$1.call(Install.java:48)
    at org.gradle.wrapper.ExclusiveFileAccessManager.access(ExclusiveFileAccessManager.java:65)
    at org.gradle.wrapper.Install.createDist(Install.java:48)
    at org.gradle.wrapper.WrapperExecutor.execute(WrapperExecutor.java:128)
    at org.gradle.wrapper.GradleWrapperMain.main(GradleWrapperMain.java:61)
ادرس وبلاگم 





id = @user138592
54
 
پاسخ دهید
 سپاس شده توسط:
این مشکل رو چطور حل کنم؟

Failed to run "javac -version", make sure that you have a JDK installed.
You can get it from: http://www.oracle.com/technetwork/java/j...downloads.
Your JAVA_HOME is invalid: C:\Program Files\Java\jdk1.8.0_181
Mdjd

[عکس: 8a6876d8c32780fdf8c0b8346c6248d2.jpg?dat...1467663560]
 
پاسخ دهید
 سپاس شده توسط:
(1398/2/20، 02:29 صبح)mdjd نوشته: این مشکل رو چطور حل کنم؟

Failed to run "javac -version", make sure that you have a JDK installed.
You can get it from: http://www.oracle.com/technetwork/java/j...downloads.
Your JAVA_HOME is invalid: C:\Program Files\Java\jdk1.8.0_181

منم با همین مشکل رو به رو بودم
 
پاسخ دهید
 سپاس شده توسط:
(1398/2/20، 02:29 صبح)mdjd نوشته: این مشکل رو چطور حل کنم؟

Failed to run "javac -version", make sure that you have a JDK installed.
You can get it from: http://www.oracle.com/technetwork/java/j...downloads.
Your JAVA_HOME is invalid: C:\Program Files\Java\jdk1.8.0_181

من دقیقا مشکلم همینه هرکاری کردم برطرف نشد
(1398/3/5، 04:52 عصر)oak نوشته:
(1398/2/20، 02:29 صبح)mdjd نوشته: این مشکل رو چطور حل کنم؟

Failed to run "javac -version", make sure that you have a JDK installed.
You can get it from: http://www.oracle.com/technetwork/java/j...downloads.
Your JAVA_HOME is invalid: C:\Program Files\Java\jdk1.8.0_181

منم با همین مشکل رو به رو بودم
چجوری برطرف کردی؟؟

فرا کانستراکت / FARA CONSTRUCT

مرجع کانستراکت ایران
کانال رسمی مرجع تخصصی کانستراکت
si2.ir و construct2.ir
 
پاسخ دهید
 سپاس شده توسط:
  


موضوعات مشابه ...
موضوع نویسنده پاسخ بازدید آخرین ارسال
Wink پلاگیدو - ساخت پلاگین بدون کدنویسی oak 46 1,555 7 ساعت قبل
آخرین ارسال: Amirmahdy
  آموزش خروجی آفلاین c2buildozer (مناسب برای تست) مهدی بابایی 18 1,303 1398/4/24، 11:34 عصر
آخرین ارسال: hesam3
Star درخواست همکاری جهت طراحی سایت آموزشی hmdnjf 0 40 1398/4/24، 10:57 عصر
آخرین ارسال: hmdnjf
  کرک کانستراکت برای تمام نسخه ها saeed 7 180 1398/4/23، 05:51 عصر
آخرین ارسال: mohammed_fn
  ترکیب فایل های nw.exe و package.nw saeed 5 109 1398/4/23، 12:58 عصر
آخرین ارسال: saeed

پرش به انجمن: