مهمان عزیز خوش‌آمدید. ورود عضــویت


ارور 'cordova-common' برای وینوس
#1
سلام
داشتم با وینوس خروجی میگرفتم که این ارور رو داد 2 :


کد:
Error: Cannot find module 'cordova-common'
    at Function.Module._resolveFilename (internal/modules/cjs/loader.js:636:15)
    at Function.Module._load (internal/modules/cjs/loader.js:562:25)
    at Module.require (internal/modules/cjs/loader.js:690:17)
    at require (internal/modules/cjs/helpers.js:25:18)
    at Object.<anonymous> (C:\Users\shah pesar\.cordova\lib\npm_cache\cordova-android\8.1.0\package\bin\create:22:20)
    at Module._compile (internal/modules/cjs/loader.js:776:30)
    at Object.Module._extensions..js (internal/modules/cjs/loader.js:787:10)
    at Module.load (internal/modules/cjs/loader.js:653:32)
    at tryModuleLoad (internal/modules/cjs/loader.js:593:12)
    at Function.Module._load (internal/modules/cjs/loader.js:585:3)
Error: cmd: Command failed with exit code 1

لطفا کمکم کنید 63  17
 
پاسخ دهید
 سپاس شده توسط:
#2
دوستان کمکم کنید باید حتما این خروجی رو بگیرم 63 2
 
پاسخ دهید
 سپاس شده توسط:
#3
سلام
پنجره cmd رو باز کنید
برای اطمینان این کد رو وارد کنید 

کد:
npm uninstall -g cordova

بعد از تموم شدن این کد رو وارد کنید
 
کد:
npm install -g [email protected]

|| فروشگاه نپتونـ! ||
|| nneptune.ir ||
|| کلیکـ کـنید ||
 
پاسخ دهید
 سپاس شده توسط: mojtaba_1
#4
خیلی ممنونم اون درست شد ولی الان باز یه ارور دیگه میده 20 :
*
کد:
********** BUILD STARTED AT 2019/11/10 02:58:50 **********
*
 
 
You have been opted out of telemetry. To change this, run: cordova telemetry on.
 
 
 
You have been opted out of telemetry. To change this, run: cordova telemetry on.
Using cordova-fetch for [email protected]:\Program Files (x86)\Vinoos\Data\platforms\cordova-android-8.1.0.tgz
Adding android project...
Creating Cordova project for the Android platform:
Path: platforms\android
Package: com.hm_game.Kharbozeh
Name: Kharbozeh
Activity: MainActivity
Android target: android-28
Subproject Path: CordovaLib
Subproject Path: app
Android project created with [email protected]
Installing "vinoos-crosswalk" for android
Subproject Path: CordovaLib
Subproject Path: app
 
 
 
You have been opted out of telemetry. To change this, run: cordova telemetry on.
Checking Java JDK and Android SDK versions
ANDROID_SDK_ROOT=undefined (recommended setting)
ANDROID_HOME=C:\Program Files (x86)\Sdk (DEPRECATED)
Starting a new Gradle Daemon for this build (subsequent builds will be faster).
:wrapper
 
BUILD SUCCESSFUL
 
Total time: 46.227 secs
Picked up _JAVA_OPTIONS: -Xmx1g
Subproject Path: CordovaLib
Subproject Path: app
Downloading [url=https://services.gradle.org/distributions/gradle-4.10.3-all.zip]https://services.gradle.org/distributions/gradle-4.10.3-all.zip[/url]
........................................................................................................................................................................................................................................................................................................................................................................................................................................................................................................................................................................................................................................................................................................................................................................................................................................................................................................................................................................................................................................................................................................................................................................................................................................................................................................................................................................................................................................................................................................................................................................................................................................................................................................................................................................................................................................................................................................................................................................................................................................................................................................................................................................................................................................................................................................................................................................................................................................................................................................................................................................................................................................................................................................................................................................................................................................................................................................................................................................................................................................................................................................................................................................................................................................................................................................................................................................................................................................................................................................................................................................................................................................................................................................................................................................................................................................................................................................................................................................................................................................................................................................................................................................................................................................................................................................................................................................................................................................................................................................................................................................................................................................................................................................................................................................................................................................................................................................................................................................................................................................................................................................................................................................................................................................................................................................................................................................................................................................................................................................................................................................................................................................................................................................................................................................................................................................................................................................................................................................................................................................................................................................................
Unzipping C:\Users\shah pesar\.gradle\wrapper\dists\gradle-4.10.3-all\81msde2dx9p4vji0mjgtvxkcb\gradle-4.10.3-all.zip to C:\Users\shah pesar\.gradle\wrapper\dists\gradle-4.10.3-all\81msde2dx9p4vji0mjgtvxkcb
 
Welcome to Gradle 4.10.3!
 
Here are the highlights of this release:
- Incremental Java compilation by default
- Periodic Gradle caches cleanup
- Gradle Kotlin DSL 1.0-RC6
- Nested included builds
- SNAPSHOT plugin versions in the `plugins {}` block
 
For more details see [url=https://docs.gradle.org/4.10.3/release-notes.html]https://docs.gradle.org/4.10.3/release-notes.html[/url]
 
Starting a Gradle Daemon (subsequent builds will be faster)
 
FAILURE: Build failed with an exception.
 
* What went wrong:
A problem occurred configuring root project 'android'.
> Could not resolve all artifacts for configuration ':classpath'.
> Could not find com.android.tools.build:gradle:3.3.0.
Searched in the following locations:
- [url=https://dl.google.com/dl/android/maven2/com/android/tools/build/gradle/3.3.0/gradle-3.3.0.pom]https://dl.google.com/dl/android/maven2/com/android/tools/build/gradle/3.3.0/gradle-3.3.0.pom[/url]
- [url=https://dl.google.com/dl/android/maven2/com/android/tools/build/gradle/3.3.0/gradle-3.3.0.jar]https://dl.google.com/dl/android/maven2/com/android/tools/build/gradle/3.3.0/gradle-3.3.0.jar[/url]
- [url=https://jcenter.bintray.com/com/android/tools/build/gradle/3.3.0/gradle-3.3.0.pom]https://jcenter.bintray.com/com/android/tools/build/gradle/3.3.0/gradle-3.3.0.pom[/url]
- [url=https://jcenter.bintray.com/com/android/tools/build/gradle/3.3.0/gradle-3.3.0.jar]https://jcenter.bintray.com/com/android/tools/build/gradle/3.3.0/gradle-3.3.0.jar[/url]
Required by:
project :
 
* Try:
Run with --stacktrace option to get the stack trace. Run with --info or --debug option to get more log output. Run with --scan to get full insights.
 
* Get more help at [url=https://help.gradle.org]https://help.gradle.org[/url]
 
BUILD FAILED in 5m 44s
C:\Users\shah pesar\Documents\Vinoos\Projects\Kharbozeh\platforms\android\gradlew: Command failed with exit code 1 Error output:
FAILURE: Build failed with an exception.
 
* What went wrong:
A problem occurred configuring root project 'android'.
> Could not resolve all artifacts for configuration ':classpath'.
> Could not find com.android.tools.build:gradle:3.3.0.
Searched in the following locations:
- [url=https://dl.google.com/dl/android/maven2/com/android/tools/build/gradle/3.3.0/gradle-3.3.0.pom]https://dl.google.com/dl/android/maven2/com/android/tools/build/gradle/3.3.0/gradle-3.3.0.pom[/url]
- [url]https://dl.google.com/dl/android/maven2/com/android/tools/build/gradle/3.3.0/gradle-3.3.0.jar[/url]
- [url]https://jcenter.bintray.com/com/android/tools/build/gradle/3.3.0/gradle-3.3.0.pom[/url]
- [url]https://jcenter.bintray.com/com/android/tools/build/gradle/3.3.0/gradle-3.3.0.jar[/url]
Required by:
project :
 
* Try:
Run with --stacktrace option to get the stack trace. Run with --info or --debug option to get more log output. Run with --scan to get full insights.
 
* Get more help at [url]https://help.gradle.org[/url]
 
BUILD FAILED in 5m 44s
Picked up _JAVA_OPTIONS: -Xmx1g
 

  20 20 20 17 39
 
پاسخ دهید
 سپاس شده توسط:
#5
(1398/8/19، 04:12 صبح)mojtaba_1 نوشته: خیلی ممنونم اون درست شد ولی الان باز یه ارور دیگه میده 20 :
*
کد:
********** BUILD STARTED AT 2019/11/10 02:58:50 **********
*
 
 
You have been opted out of telemetry. To change this, run: cordova telemetry on.
 
 
 
You have been opted out of telemetry. To change this, run: cordova telemetry on.
Using cordova-fetch for [email protected]:\Program Files (x86)\Vinoos\Data\platforms\cordova-android-8.1.0.tgz
Adding android project...
Creating Cordova project for the Android platform:
Path: platforms\android
Package: com.hm_game.Kharbozeh
Name: Kharbozeh
Activity: MainActivity
Android target: android-28
Subproject Path: CordovaLib
Subproject Path: app
Android project created with [email protected]
Installing "vinoos-crosswalk" for android
Subproject Path: CordovaLib
Subproject Path: app
 
 
 
You have been opted out of telemetry. To change this, run: cordova telemetry on.
Checking Java JDK and Android SDK versions
ANDROID_SDK_ROOT=undefined (recommended setting)
ANDROID_HOME=C:\Program Files (x86)\Sdk (DEPRECATED)
Starting a new Gradle Daemon for this build (subsequent builds will be faster).
:wrapper
 
BUILD SUCCESSFUL
 
Total time: 46.227 secs
Picked up _JAVA_OPTIONS: -Xmx1g
Subproject Path: CordovaLib
Subproject Path: app
Downloading [url=https://services.gradle.org/distributions/gradle-4.10.3-all.zip]https://services.gradle.org/distributions/gradle-4.10.3-all.zip[/url]
........................................................................................................................................................................................................................................................................................................................................................................................................................................................................................................................................................................................................................................................................................................................................................................................................................................................................................................................................................................................................................................................................................................................................................................................................................................................................................................................................................................................................................................................................................................................................................................................................................................................................................................................................................................................................................................................................................................................................................................................................................................................................................................................................................................................................................................................................................................................................................................................................................................................................................................................................................................................................................................................................................................................................................................................................................................................................................................................................................................................................................................................................................................................................................................................................................................................................................................................................................................................................................................................................................................................................................................................................................................................................................................................................................................................................................................................................................................................................................................................................................................................................................................................................................................................................................................................................................................................................................................................................................................................................................................................................................................................................................................................................................................................................................................................................................................................................................................................................................................................................................................................................................................................................................................................................................................................................................................................................................................................................................................................................................................................................................................................................................................................................................................................................................................................................................................................................................................................................................................................................................................................................................................................
Unzipping C:\Users\shah pesar\.gradle\wrapper\dists\gradle-4.10.3-all\81msde2dx9p4vji0mjgtvxkcb\gradle-4.10.3-all.zip to C:\Users\shah pesar\.gradle\wrapper\dists\gradle-4.10.3-all\81msde2dx9p4vji0mjgtvxkcb
 
Welcome to Gradle 4.10.3!
 
Here are the highlights of this release:
- Incremental Java compilation by default
- Periodic Gradle caches cleanup
- Gradle Kotlin DSL 1.0-RC6
- Nested included builds
- SNAPSHOT plugin versions in the `plugins {}` block
 
For more details see [url=https://docs.gradle.org/4.10.3/release-notes.html]https://docs.gradle.org/4.10.3/release-notes.html[/url]
 
Starting a Gradle Daemon (subsequent builds will be faster)
 
FAILURE: Build failed with an exception.
 
* What went wrong:
A problem occurred configuring root project 'android'.
> Could not resolve all artifacts for configuration ':classpath'.
> Could not find com.android.tools.build:gradle:3.3.0.
Searched in the following locations:
- [url=https://dl.google.com/dl/android/maven2/com/android/tools/build/gradle/3.3.0/gradle-3.3.0.pom]https://dl.google.com/dl/android/maven2/com/android/tools/build/gradle/3.3.0/gradle-3.3.0.pom[/url]
- [url=https://dl.google.com/dl/android/maven2/com/android/tools/build/gradle/3.3.0/gradle-3.3.0.jar]https://dl.google.com/dl/android/maven2/com/android/tools/build/gradle/3.3.0/gradle-3.3.0.jar[/url]
- [url=https://jcenter.bintray.com/com/android/tools/build/gradle/3.3.0/gradle-3.3.0.pom]https://jcenter.bintray.com/com/android/tools/build/gradle/3.3.0/gradle-3.3.0.pom[/url]
- [url=https://jcenter.bintray.com/com/android/tools/build/gradle/3.3.0/gradle-3.3.0.jar]https://jcenter.bintray.com/com/android/tools/build/gradle/3.3.0/gradle-3.3.0.jar[/url]
Required by:
project :
 
* Try:
Run with --stacktrace option to get the stack trace. Run with --info or --debug option to get more log output. Run with --scan to get full insights.
 
* Get more help at [url=https://help.gradle.org]https://help.gradle.org[/url]
 
BUILD FAILED in 5m 44s
C:\Users\shah pesar\Documents\Vinoos\Projects\Kharbozeh\platforms\android\gradlew: Command failed with exit code 1 Error output:
FAILURE: Build failed with an exception.
 
* What went wrong:
A problem occurred configuring root project 'android'.
> Could not resolve all artifacts for configuration ':classpath'.
> Could not find com.android.tools.build:gradle:3.3.0.
Searched in the following locations:
- [url=https://dl.google.com/dl/android/maven2/com/android/tools/build/gradle/3.3.0/gradle-3.3.0.pom]https://dl.google.com/dl/android/maven2/com/android/tools/build/gradle/3.3.0/gradle-3.3.0.pom[/url]
- [url=https://dl.google.com/dl/android/maven2/com/android/tools/build/gradle/3.3.0/gradle-3.3.0.jar]https://dl.google.com/dl/android/maven2/com/android/tools/build/gradle/3.3.0/gradle-3.3.0.jar[/url]
- [url=https://jcenter.bintray.com/com/android/tools/build/gradle/3.3.0/gradle-3.3.0.pom]https://jcenter.bintray.com/com/android/tools/build/gradle/3.3.0/gradle-3.3.0.pom[/url]
- [url=https://jcenter.bintray.com/com/android/tools/build/gradle/3.3.0/gradle-3.3.0.jar]https://jcenter.bintray.com/com/android/tools/build/gradle/3.3.0/gradle-3.3.0.jar[/url]
Required by:
project :
 
* Try:
Run with --stacktrace option to get the stack trace. Run with --info or --debug option to get more log output. Run with --scan to get full insights.
 
* Get more help at [url=https://help.gradle.org]https://help.gradle.org[/url]
 
BUILD FAILED in 5m 44s
Picked up _JAVA_OPTIONS: -Xmx1g
 

  20 20 20 17 39

فی لتر شکن روشن کنید و بعد خروجی رو دوباره بگیرید .
[عکس: Background_Screen_WithLogo_860_WithTextL...Banner.png]
 
پاسخ دهید
 سپاس شده توسط: mojtaba_1
#6
باز این ارور رو میده 20 :
کد:
*
********** BUILD STARTED AT 2019/11/11 05:39:31 **********
*


You have been opted out of telemetry. To change this, run: cordova telemetry on.



You have been opted out of telemetry. To change this, run: cordova telemetry on.
Using cordova-fetch for [email protected]:\Program Files (x86)\Vinoos\Data\platforms\cordova-android-8.1.0.tgz
Adding android project...
Creating Cordova project for the Android platform:
    Path: platforms\android
    Package: com.hm_game.Kharbozeh
    Name: Kharbozeh
    Activity: MainActivity
    Android target: android-28
Subproject Path: CordovaLib
Subproject Path: app
Android project created with [email protected]
Installing "vinoos-crosswalk" for android
Subproject Path: CordovaLib
Subproject Path: app



You have been opted out of telemetry. To change this, run: cordova telemetry on.
Checking Java JDK and Android SDK versions
ANDROID_SDK_ROOT=undefined (recommended setting)
ANDROID_HOME=C:\Program Files (x86)\Sdk (DEPRECATED)
Starting a new Gradle Daemon for this build (subsequent builds will be faster).
:wrapper

BUILD SUCCESSFUL

Total time: 36.796 secs
Picked up _JAVA_OPTIONS: -Xmx1g
Subproject Path: CordovaLib
Subproject Path: app
Starting a Gradle Daemon, 1 incompatible and 1 stopped Daemons could not be reused, use --status for details

FAILURE: Build failed with an exception.

* What went wrong:
A problem occurred configuring root project 'android'.
> Could not resolve all artifacts for configuration ':classpath'.
  > Could not find com.android.tools.build:gradle:3.3.0.
    Searched in the following locations:
      - [url=https://dl.google.com/dl/android/maven2/com/android/tools/build/gradle/3.3.0/gradle-3.3.0.pom]https://dl.google.com/dl/android/maven2/com/android/tools/build/gradle/3.3.0/gradle-3.3.0.pom[/url]
      - [url=https://dl.google.com/dl/android/maven2/com/android/tools/build/gradle/3.3.0/gradle-3.3.0.jar]https://dl.google.com/dl/android/maven2/com/android/tools/build/gradle/3.3.0/gradle-3.3.0.jar[/url]
      - [url=https://jcenter.bintray.com/com/android/tools/build/gradle/3.3.0/gradle-3.3.0.pom]https://jcenter.bintray.com/com/android/tools/build/gradle/3.3.0/gradle-3.3.0.pom[/url]
      - [url=https://jcenter.bintray.com/com/android/tools/build/gradle/3.3.0/gradle-3.3.0.jar]https://jcenter.bintray.com/com/android/tools/build/gradle/3.3.0/gradle-3.3.0.jar[/url]
    Required by:
        project :

* Try:
Run with --stacktrace option to get the stack trace. Run with --info or --debug option to get more log output. Run with --scan to get full insights.

* Get more help at [url=https://help.gradle.org]https://help.gradle.org[/url]

BUILD FAILED in 43s
C:\Users\shah pesar\Documents\Vinoos\Projects\Kharbozeh\platforms\android\gradlew: Command failed with exit code 1 Error output:
FAILURE: Build failed with an exception.

* What went wrong:
A problem occurred configuring root project 'android'.
> Could not resolve all artifacts for configuration ':classpath'.
  > Could not find com.android.tools.build:gradle:3.3.0.
    Searched in the following locations:
      - [url=https://dl.google.com/dl/android/maven2/com/android/tools/build/gradle/3.3.0/gradle-3.3.0.pom]https://dl.google.com/dl/android/maven2/com/android/tools/build/gradle/3.3.0/gradle-3.3.0.pom[/url]
      - [url=https://dl.google.com/dl/android/maven2/com/android/tools/build/gradle/3.3.0/gradle-3.3.0.jar]https://dl.google.com/dl/android/maven2/com/android/tools/build/gradle/3.3.0/gradle-3.3.0.jar[/url]
      - [url=https://jcenter.bintray.com/com/android/tools/build/gradle/3.3.0/gradle-3.3.0.pom]https://jcenter.bintray.com/com/android/tools/build/gradle/3.3.0/gradle-3.3.0.pom[/url]
      - [url=https://jcenter.bintray.com/com/android/tools/build/gradle/3.3.0/gradle-3.3.0.jar]https://jcenter.bintray.com/com/android/tools/build/gradle/3.3.0/gradle-3.3.0.jar[/url]
    Required by:
        project :

* Try:

Run with --stacktrace option to get the stack trace. Run with --info or --debug option to get more log output. Run with --scan to get full insights.

* Get more help at [url=https://help.gradle.org]https://help.gradle.org[/url]

BUILD FAILED in 43s
Picked up _JAVA_OPTIONS: -Xmx1g
 
پاسخ دهید
 سپاس شده توسط:
#7
(1398/8/20، 06:52 صبح)mojtaba_1 نوشته: باز این ارور رو میده 20 :
کد:
*
********** BUILD STARTED AT 2019/11/11 05:39:31 **********
*


You have been opted out of telemetry. To change this, run: cordova telemetry on.



You have been opted out of telemetry. To change this, run: cordova telemetry on.
Using cordova-fetch for [email protected]:\Program Files (x86)\Vinoos\Data\platforms\cordova-android-8.1.0.tgz
Adding android project...
Creating Cordova project for the Android platform:
    Path: platforms\android
    Package: com.hm_game.Kharbozeh
    Name: Kharbozeh
    Activity: MainActivity
    Android target: android-28
Subproject Path: CordovaLib
Subproject Path: app
Android project created with [email protected]
Installing "vinoos-crosswalk" for android
Subproject Path: CordovaLib
Subproject Path: app



You have been opted out of telemetry. To change this, run: cordova telemetry on.
Checking Java JDK and Android SDK versions
ANDROID_SDK_ROOT=undefined (recommended setting)
ANDROID_HOME=C:\Program Files (x86)\Sdk (DEPRECATED)
Starting a new Gradle Daemon for this build (subsequent builds will be faster).
:wrapper

BUILD SUCCESSFUL

Total time: 36.796 secs
Picked up _JAVA_OPTIONS: -Xmx1g
Subproject Path: CordovaLib
Subproject Path: app
Starting a Gradle Daemon, 1 incompatible and 1 stopped Daemons could not be reused, use --status for details

FAILURE: Build failed with an exception.

* What went wrong:
A problem occurred configuring root project 'android'.
> Could not resolve all artifacts for configuration ':classpath'.
  > Could not find com.android.tools.build:gradle:3.3.0.
    Searched in the following locations:
      - [url=https://dl.google.com/dl/android/maven2/com/android/tools/build/gradle/3.3.0/gradle-3.3.0.pom]https://dl.google.com/dl/android/maven2/com/android/tools/build/gradle/3.3.0/gradle-3.3.0.pom[/url]
      - [url=https://dl.google.com/dl/android/maven2/com/android/tools/build/gradle/3.3.0/gradle-3.3.0.jar]https://dl.google.com/dl/android/maven2/com/android/tools/build/gradle/3.3.0/gradle-3.3.0.jar[/url]
      - [url=https://jcenter.bintray.com/com/android/tools/build/gradle/3.3.0/gradle-3.3.0.pom]https://jcenter.bintray.com/com/android/tools/build/gradle/3.3.0/gradle-3.3.0.pom[/url]
      - [url=https://jcenter.bintray.com/com/android/tools/build/gradle/3.3.0/gradle-3.3.0.jar]https://jcenter.bintray.com/com/android/tools/build/gradle/3.3.0/gradle-3.3.0.jar[/url]
    Required by:
        project :

* Try:
Run with --stacktrace option to get the stack trace. Run with --info or --debug option to get more log output. Run with --scan to get full insights.

* Get more help at [url=https://help.gradle.org]https://help.gradle.org[/url]

BUILD FAILED in 43s
C:\Users\shah pesar\Documents\Vinoos\Projects\Kharbozeh\platforms\android\gradlew: Command failed with exit code 1 Error output:
FAILURE: Build failed with an exception.

* What went wrong:
A problem occurred configuring root project 'android'.
> Could not resolve all artifacts for configuration ':classpath'.
  > Could not find com.android.tools.build:gradle:3.3.0.
    Searched in the following locations:
      - [url=https://dl.google.com/dl/android/maven2/com/android/tools/build/gradle/3.3.0/gradle-3.3.0.pom]https://dl.google.com/dl/android/maven2/com/android/tools/build/gradle/3.3.0/gradle-3.3.0.pom[/url]
      - [url=https://dl.google.com/dl/android/maven2/com/android/tools/build/gradle/3.3.0/gradle-3.3.0.jar]https://dl.google.com/dl/android/maven2/com/android/tools/build/gradle/3.3.0/gradle-3.3.0.jar[/url]
      - [url=https://jcenter.bintray.com/com/android/tools/build/gradle/3.3.0/gradle-3.3.0.pom]https://jcenter.bintray.com/com/android/tools/build/gradle/3.3.0/gradle-3.3.0.pom[/url]
      - [url=https://jcenter.bintray.com/com/android/tools/build/gradle/3.3.0/gradle-3.3.0.jar]https://jcenter.bintray.com/com/android/tools/build/gradle/3.3.0/gradle-3.3.0.jar[/url]
    Required by:
        project :

* Try:

Run with --stacktrace option to get the stack trace. Run with --info or --debug option to get more log output. Run with --scan to get full insights.

* Get more help at [url=https://help.gradle.org]https://help.gradle.org[/url]

BUILD FAILED in 43s
Picked up _JAVA_OPTIONS: -Xmx1g

دوست عزیز چرا توجه نمیکنی ؟؟؟
این ارور همون ارور قبلی هست ، اینو یعنی شما نمیفهمی ؟
لوکیشن فی لترشکن رو عوض کنید تا مشکلتون حل بشه ؛ از ی تحریم شکن درست و درمون استفاده کنید .
[عکس: Background_Screen_WithLogo_860_WithTextL...Banner.png]
 
پاسخ دهید
 سپاس شده توسط:
  


موضوعات مشابه ...
موضوع نویسنده پاسخ بازدید آخرین ارسال
  چند سورس خفن "M.gh" 4 82 1398/8/20، 03:33 عصر
آخرین ارسال: "M.gh"
Question خروجی کراسواک چگونه؟ akhm2002 10 116 1398/8/20، 03:05 عصر
آخرین ارسال: "M.gh"
  آموزش ساخت بازی دونفره در شبکه ی محلّی(دو نفره) "M.gh" 2 98 1398/8/19، 07:29 عصر
آخرین ارسال: "M.gh"
  نظر درباره ی سود برنامه ای مهدی 1 6 136 1398/8/18، 10:05 عصر
آخرین ارسال: amin COD
  سیاه شدن صفحه S.L.F 0 31 1398/8/17، 06:41 عصر
آخرین ارسال: S.L.F

پرش به انجمن: