وینوس - خروجی آفلاین اندروید
نویسنده پیام
hiddendanger آفلاین
Saitama
عضو عادی

ارسال‌ها: 215
موضوع‌ها: 36
تاریخ عضویت: مهر 1395
اعتبار: 1
سپاس‌ها: 333
134 سپاس گرفته‌شده در 72 ارسال

RE: وینوس - خروجی آفلاین اندروید
(1398/4/7، 10:45 صبح)Amir DARK نوشته است: *
********** BUILD STARTED AT 1398/04/07 104106 **********
*


You have been opted out of telemetry. To change this, run: cordova telemetry on.
Removing platform android from config.xml file...



You have been opted out of telemetry. To change this, run: cordova telemetry on.
Adding android project...
Creating Cordova project for the Android platform:
Path: platforms\android
Package: ir.zgames.test
Name: Test
Activity: MainActivity
Android target: android-25
Subproject Path: CordovaLib
Android project created with [email protected]
Installing "vinoos-canvasplus" for android
Subproject Path: CordovaLib
--save flag or autosave detected
Saving [email protected]:\pack_vinoos\vinoos\Data\platforms\6.2.3.tgz into config.xml file ...



You have been opted out of telemetry. To change this, run: cordova telemetry on.
ANDROID_HOME=D:\pack_vinoos\sdkv\platforms
JAVA_HOME=C:\Program Files\Java\jdk1.8.0_172
:wrapper

BUILD SUCCESSFUL

Total time: 4.108 secs
Picked up _JAVA_OPTIONS: -Xmx2g
Subproject Path: CordovaLib
Failed to notify ProjectEvaluationListener.afterEvaluate(), but primary configuration failure takes precedence.
java.lang.IllegalStateException: buildToolsVersion is not specified.
at com.google.common.base.Preconditions.checkState(Preconditions.java:173)
at com.android.build.gradle.BasePlugin.createAndroidTasks(BasePlugin.java:645)
at com.android.build.gradle.BasePlugin$10.call(BasePlugin.java:608)
at com.android.build.gradle.BasePlugin$10.call(BasePlugin.java:605)
at com.android.builder.profile.ThreadRecorder.record(ThreadRecorder.java:156)
at com.android.builder.profile.ThreadRecorder.record(ThreadRecorder.java:120)
at com.android.build.gradle.BasePlugin.lambda$createTasks$1(BasePlugin.java:603)
at org.gradle.internal.event.BroadcastDispatch$ActionInvocationHandler.dispatch(BroadcastDispatch.java:93)
at org.gradle.internal.event.BroadcastDispatch$ActionInvocationHandler.dispatch(BroadcastDispatch.java:82)
at org.gradle.internal.event.AbstractBroadcastDispatch.dispatch(AbstractBroadcastDispatch.java:44)
at org.gradle.internal.event.BroadcastDispatch.dispatch(BroadcastDispatch.java:79)
at org.gradle.internal.event.BroadcastDispatch.dispatch(BroadcastDispatch.java:30)
at org.gradle.internal.dispatch.ProxyDispatchAdapter$DispatchingInvocationHandler.invoke(ProxyDispatchAdapter.java:93)
at com.sun.proxy.$Proxy16.afterEvaluate(Unknown Source)
at org.gradle.configuration.project.LifecycleProjectEvaluator.notifyAfterEvaluate(LifecycleProjectEvaluator.java:82)
at org.gradle.configuration.project.LifecycleProjectEvaluator.doConfigure(LifecycleProjectEvaluator.java:76)
at org.gradle.configuration.project.LifecycleProjectEvaluator.access$000(LifecycleProjectEvaluator.java:33)
at org.gradle.configuration.project.LifecycleProjectEvaluator$1.execute(LifecycleProjectEvaluator.java:53)
at org.gradle.configuration.project.LifecycleProjectEvaluator$1.execute(LifecycleProjectEvaluator.java:50)
at org.gradle.internal.Transformers$4.transform(Transformers.java:169)
at org.gradle.internal.progress.DefaultBuildOperationExecutor.run(DefaultBuildOperationExecutor.java:106)
at org.gradle.internal.progress.DefaultBuildOperationExecutor.run(DefaultBuildOperationExecutor.java:61)
at org.gradle.configuration.project.LifecycleProjectEvaluator.evaluate(LifecycleProjectEvaluator.java:50)
at org.gradle.api.internal.project.DefaultProject.evaluate(DefaultProject.java:628)
at org.gradle.api.internal.project.DefaultProject.evaluate(DefaultProject.java:129)
at org.gradle.execution.TaskPathProjectEvaluator.configure(TaskPathProjectEvaluator.java:35)
at org.gradle.execution.TaskPathProjectEvaluator.configureHierarchy(TaskPathProjectEvaluator.java:60)

at org.gradle.configuration.DefaultBuildConfigurer.configure(DefaultBuildConfigurer.java:38)
BUILD FAILED
at org.gradle.initialization.DefaultGradleLauncher$1.execute(DefaultGradleLauncher.java:161)

at org.gradle.initialization.DefaultGradleLauncher$1.execute(DefaultGradleLauncher.java:158)
Total time: 2.153 secs
at org.gradle.internal.Transformers$4.transform(Transformers.java:169)
at org.gradle.internal.progress.DefaultBuildOperationExecutor.run(DefaultBuildOperationExecutor.java:106)
at org.gradle.internal.progress.DefaultBuildOperationExecutor.run(DefaultBuildOperationExecutor.java:56)
at org.gradle.initialization.DefaultGradleLauncher.doBuildStages(DefaultGradleLauncher.java:158)
at org.gradle.initialization.DefaultGradleLauncher.doBuild(DefaultGradleLauncher.java:119)
at org.gradle.initialization.DefaultGradleLauncher.run(DefaultGradleLauncher.java:102)
at org.gradle.launcher.exec.GradleBuildController.run(GradleBuildController.java:71)
at org.gradle.tooling.internal.provider.ExecuteBuildActionRunner.run(ExecuteBuildActionRunner.java:28)
at org.gradle.launcher.exec.ChainingBuildActionRunner.run(ChainingBuildActionRunner.java:35)
at org.gradle.launcher.exec.InProcessBuildActionExecuter.execute(InProcessBuildActionExecuter.java:41)
at org.gradle.launcher.exec.InProcessBuildActionExecuter.execute(InProcessBuildActionExecuter.java:26)
at org.gradle.tooling.internal.provider.ContinuousBuildActionExecuter.execute(ContinuousBuildActionExecuter.java:75)
at org.gradle.tooling.internal.provider.ContinuousBuildActionExecuter.execute(ContinuousBuildActionExecuter.java:49)
at org.gradle.tooling.internal.provider.ServicesSetupBuildActionExecuter.execute(ServicesSetupBuildActionExecuter.java:44)
at org.gradle.tooling.internal.provider.ServicesSetupBuildActionExecuter.execute(ServicesSetupBuildActionExecuter.java:29)
at org.gradle.launcher.daemon.server.exec.ExecuteBuild.doBuild(ExecuteBuild.java:67)
at org.gradle.launcher.daemon.server.exec.BuildCommandOnly.execute(BuildCommandOnly.java:36)
at org.gradle.launcher.daemon.server.api.DaemonCommandExecution.proceed(DaemonCommandExecution.java:120)
at org.gradle.launcher.daemon.server.exec.WatchForDisconnection.execute(WatchForDisconnection.java:47)
at org.gradle.launcher.daemon.server.api.DaemonCommandExecution.proceed(DaemonCommandExecution.java:120)
at org.gradle.launcher.daemon.server.exec.ResetDeprecationLogger.execute(ResetDeprecationLogger.java:26)
at org.gradle.launcher.daemon.server.api.DaemonCommandExecution.proceed(DaemonCommandExecution.java:120)
at org.gradle.launcher.daemon.server.exec.RequestStopIfSingleUsedDaemon.execute(RequestStopIfSingleUsedDaemon.java:34)
at org.gradle.launcher.daemon.server.api.DaemonCommandExecution.proceed(DaemonCommandExecution.java:120)
at org.gradle.launcher.daemon.server.exec.ForwardClientInput$2.call(ForwardClientInput.java:74)
at org.gradle.launcher.daemon.server.exec.ForwardClientInput$2.call(ForwardClientInput.java:72)
at org.gradle.util.Swapper.swap(Swapper.java:38)
at org.gradle.launcher.daemon.server.exec.ForwardClientInput.execute(ForwardClientInput.java:72)
at org.gradle.launcher.daemon.server.api.DaemonCommandExecution.proceed(DaemonCommandExecution.java:120)
at org.gradle.launcher.daemon.server.exec.LogAndCheckHealth.execute(LogAndCheckHealth.java:55)
at org.gradle.launcher.daemon.server.api.DaemonCommandExecution.proceed(DaemonCommandExecution.java:120)
at org.gradle.launcher.daemon.server.exec.LogToClient.doBuild(LogToClient.java:60)
at org.gradle.launcher.daemon.server.exec.BuildCommandOnly.execute(BuildCommandOnly.java:36)
at org.gradle.launcher.daemon.server.api.DaemonCommandExecution.proceed(DaemonCommandExecution.java:120)
at org.gradle.launcher.daemon.server.exec.EstablishBuildEnvironment.doBuild(EstablishBuildEnvironment.java:72)
at org.gradle.launcher.daemon.server.exec.BuildCommandOnly.execute(BuildCommandOnly.java:36)
at org.gradle.launcher.daemon.server.api.DaemonCommandExecution.proceed(DaemonCommandExecution.java:120)
at org.gradle.launcher.daemon.server.exec.StartBuildOrRespondWithBusy$1.run(StartBuildOrRespondWithBusy.java:50)
at org.gradle.launcher.daemon.server.DaemonStateCoordinator$1.run(DaemonStateCoordinator.java:297)
at org.gradle.internal.concurrent.ExecutorPolicy$CatchAndRecordFailures.onExecute(ExecutorPolicy.java:54)
at org.gradle.internal.concurrent.StoppableExecutorImpl$1.run(StoppableExecutorImpl.java:40)
at java.util.concurrent.ThreadPoolExecutor.runWorker(ThreadPoolExecutor.java:1149)
at java.util.concurrent.ThreadPoolExecutor$Worker.run(ThreadPoolExecutor.java:624)
at java.lang.Thread.run(Thread.java:748)

FAILURE: Build failed with an exception.

* Where:
Script 'C:\Users\DELL\Documents\Vinoos\Projects\asd\platforms\android\CordovaLib\cordova.gradle' line: 64

* What went wrong:
A problem occurred evaluating root project 'android'.
> No installed build tools found. Install the Android build tools version 19.1.0 or higher.

* Try:
Run with --stacktrace option to get the stack trace. Run with --info or --debug option to get more log output.
Picked up _JAVA_OPTIONS: -Xmx2g
Error: cmd: Command failed with exit code 1 Error output:
Failed to notify ProjectEvaluationListener.afterEvaluate(), but primary configuration failure takes precedence.
java.lang.IllegalStateException: buildToolsVersion is not specified.
at com.google.common.base.Preconditions.checkState(Preconditions.java:173)
at com.android.build.gradle.BasePlugin.createAndroidTasks(BasePlugin.java:645)
at com.android.build.gradle.BasePlugin$10.call(BasePlugin.java:608)
at com.android.build.gradle.BasePlugin$10.call(BasePlugin.java:605)
at com.android.builder.profile.ThreadRecorder.record(ThreadRecorder.java:156)
at com.android.builder.profile.ThreadRecorder.record(ThreadRecorder.java:120)
at com.android.build.gradle.BasePlugin.lambda$createTasks$1(BasePlugin.java:603)
at org.gradle.internal.event.BroadcastDispatch$ActionInvocationHandler.dispatch(BroadcastDispatch.java:93)
at org.gradle.internal.event.BroadcastDispatch$ActionInvocationHandler.dispatch(BroadcastDispatch.java:82)
at org.gradle.internal.event.AbstractBroadcastDispatch.dispatch(AbstractBroadcastDispatch.java:44)
at org.gradle.internal.event.BroadcastDispatch.dispatch(BroadcastDispatch.java:79)
at org.gradle.internal.event.BroadcastDispatch.dispatch(BroadcastDispatch.java:30)
at org.gradle.internal.dispatch.ProxyDispatchAdapter$DispatchingInvocationHandler.invoke(ProxyDispatchAdapter.java:93)
at com.sun.proxy.$Proxy16.afterEvaluate(Unknown Source)
at org.gradle.configuration.project.LifecycleProjectEvaluator.notifyAfterEvaluate(LifecycleProjectEvaluator.java:82)
at org.gradle.configuration.project.LifecycleProjectEvaluator.doConfigure(LifecycleProjectEvaluator.java:76)
at org.gradle.configuration.project.LifecycleProjectEvaluator.access$000(LifecycleProjectEvaluator.java:33)
at org.gradle.configuration.project.LifecycleProjectEvaluator$1.execute(LifecycleProjectEvaluator.java:53)
at org.gradle.configuration.project.LifecycleProjectEvaluator$1.execute(LifecycleProjectEvaluator.java:50)
at org.gradle.internal.Transformers$4.transform(Transformers.java:169)
at org.gradle.internal.progress.DefaultBuildOperationExecutor.run(DefaultBuildOperationExecutor.java:106)
at org.gradle.internal.progress.DefaultBuildOperationExecutor.run(DefaultBuildOperationExecutor.java:61)
at org.gradle.configuration.project.LifecycleProjectEvaluator.evaluate(LifecycleProjectEvaluator.java:50)
at org.gradle.api.internal.project.DefaultProject.evaluate(DefaultProject.java:628)
at org.gradle.api.internal.project.DefaultProject.evaluate(DefaultProject.java:129)
at org.gradle.execution.TaskPathProjectEvaluator.configure(TaskPathProjectEvaluator.java:35)
at org.gradle.execution.TaskPathProjectEvaluator.configureHierarchy(TaskPathProjectEvaluator.java:60)
at org.gradle.configuration.DefaultBuildConfigurer.configure(DefaultBuildConfigurer.java:38)
at org.gradle.initialization.DefaultGradleLauncher$1.execute(DefaultGradleLauncher.java:161)
at org.gradle.initialization.DefaultGradleLauncher$1.execute(DefaultGradleLauncher.java:158)

at org.gradle.internal.Transformers$4.transform(Transformers.java:169)
at org.gradle.internal.progress.DefaultBuildOperationExecutor.run(DefaultBuildOperationExecutor.java:106)
at org.gradle.internal.progress.DefaultBuildOperationExecutor.run(DefaultBuildOperationExecutor.java:56)
at org.gradle.initialization.DefaultGradleLauncher.doBuildStages(DefaultGradleLauncher.java:158)
at org.gradle.initialization.DefaultGradleLauncher.doBuild(DefaultGradleLauncher.java:119)
at org.gradle.initialization.DefaultGradleLauncher.run(DefaultGradleLauncher.java:102)
at org.gradle.launcher.exec.GradleBuildController.run(GradleBuildController.java:71)
at org.gradle.tooling.internal.provider.ExecuteBuildActionRunner.run(ExecuteBuildActionRunner.java:28)
at org.gradle.launcher.exec.ChainingBuildActionRunner.run(ChainingBuildActionRunner.java:35)
at org.gradle.launcher.exec.InProcessBuildActionExecuter.execute(InProcessBuildActionExecuter.java:41)
at org.gradle.launcher.exec.InProcessBuildActionExecuter.execute(InProcessBuildActionExecuter.java:26)
at org.gradle.tooling.internal.provider.ContinuousBuildActionExecuter.execute(ContinuousBuildActionExecuter.java:75)
at org.gradle.tooling.internal.provider.ContinuousBuildActionExecuter.execute(ContinuousBuildActionExecuter.java:49)
at org.gradle.tooling.internal.provider.ServicesSetupBuildActionExecuter.execute(ServicesSetupBuildActionExecuter.java:44)
at org.gradle.tooling.internal.provider.ServicesSetupBuildActionExecuter.execute(ServicesSetupBuildActionExecuter.java:29)
at org.gradle.launcher.daemon.server.exec.ExecuteBuild.doBuild(ExecuteBuild.java:67)
at org.gradle.launcher.daemon.server.exec.BuildCommandOnly.execute(BuildCommandOnly.java:36)
at org.gradle.launcher.daemon.server.api.DaemonCommandExecution.proceed(DaemonCommandExecution.java:120)
at org.gradle.launcher.daemon.server.exec.WatchForDisconnection.execute(WatchForDisconnection.java:47)
at org.gradle.launcher.daemon.server.api.DaemonCommandExecution.proceed(DaemonCommandExecution.java:120)
at org.gradle.launcher.daemon.server.exec.ResetDeprecationLogger.execute(ResetDeprecationLogger.java:26)
at org.gradle.launcher.daemon.server.api.DaemonCommandExecution.proceed(DaemonCommandExecution.java:120)
at org.gradle.launcher.daemon.server.exec.RequestStopIfSingleUsedDaemon.execute(RequestStopIfSingleUsedDaemon.java:34)
at org.gradle.launcher.daemon.server.api.DaemonCommandExecution.proceed(DaemonCommandExecution.java:120)
at org.gradle.launcher.daemon.server.exec.ForwardClientInput$2.call(ForwardClientInput.java:74)
at org.gradle.launcher.daemon.server.exec.ForwardClientInput$2.call(ForwardClientInput.java:72)
at org.gradle.util.Swapper.swap(Swapper.java:38)
at org.gradle.launcher.daemon.server.exec.ForwardClientInput.execute(ForwardClientInput.java:72)
at org.gradle.launcher.daemon.server.api.DaemonCommandExecution.proceed(DaemonCommandExecution.java:120)
at org.gradle.launcher.daemon.server.exec.LogAndCheckHealth.execute(LogAndCheckHealth.java:55)
at org.gradle.launcher.daemon.server.api.DaemonCommandExecution.proceed(DaemonCommandExecution.java:120)
at org.gradle.launcher.daemon.server.exec.LogToClient.doBuild(LogToClient.java:60)
at org.gradle.launcher.daemon.server.exec.BuildCommandOnly.execute(BuildCommandOnly.java:36)
at org.gradle.launcher.daemon.server.api.DaemonCommandExecution.proceed(DaemonCommandExecution.java:120)
at org.gradle.launcher.daemon.server.exec.EstablishBuildEnvironment.doBuild(EstablishBuildEnvironment.java:72)
at org.gradle.launcher.daemon.server.exec.BuildCommandOnly.execute(BuildCommandOnly.java:36)
at org.gradle.launcher.daemon.server.api.DaemonCommandExecution.proceed(DaemonCommandExecution.java:120)
at org.gradle.launcher.daemon.server.exec.StartBuildOrRespondWithBusy$1.run(StartBuildOrRespondWithBusy.java:50)
at org.gradle.launcher.daemon.server.DaemonStateCoordinator$1.run(DaemonStateCoordinator.java:297)
at org.gradle.internal.concurrent.ExecutorPolicy$CatchAndRecordFailures.onExecute(ExecutorPolicy.java:54)
at org.gradle.internal.concurrent.StoppableExecutorImpl$1.run(StoppableExecutorImpl.java:40)
at java.util.concurrent.ThreadPoolExecutor.runWorker(ThreadPoolExecutor.java:1149)
at java.util.concurrent.ThreadPoolExecutor$Worker.run(ThreadPoolExecutor.java:624)
at java.lang.Thread.run(Thread.java:748)

FAILURE: Build failed with an exception.

* Where:
Script 'C:\Users\DELL\Documents\Vinoos\Projects\asd\platforms\android\CordovaLib\cordova.gradle' line: 64

* What went wrong:
A problem occurred evaluating root project 'android'.
> No installed build tools found. Install the Android build tools version 19.1.0 or higher.

* Try:
Run with --stacktrace option to get the stack trace. Run with --info or --debug option to get more log output.
Picked up _JAVA_OPTIONS: -Xmx2g



-----------------------------------------
موقع بیلد این ارور رو میده
همه ی پیش نیاز ها هم به درستی نصب شده 

میگه توی android sdk ، بیلد تولز نسخه 19.1.0 یا بالاتر رو نصب کنید
1398/4/7، 10:50 صبح
ارسال‌ها پاسخ
sirra.rozblog.com آفلاین
عضو فعّال
عضو عادی

ارسال‌ها: 10
موضوع‌ها: 3
تاریخ عضویت: تير 1398
اعتبار: 0
سپاس‌ها: 0
5 سپاس گرفته‌شده در 4 ارسال

RE: وینوس - خروجی آفلاین اندروید

سلام میخواستم بدونم وینوس روی سیستم32 بیتی ران میشه؟؟؟؟؟
و تا چه تارگت اس دی ک خروجی میده؟؟؟؟؟؟؟؟؟؟؟؟؟؟؟؟؟؟؟؟؟؟؟؟؟؟؟؟
1398/4/7، 06:11 عصر
ارسال‌ها پاسخ
Amir DARK آفلاین
عضو فعّال
عضو عادی

ارسال‌ها: 13
موضوع‌ها: 2
تاریخ عضویت: تير 1397
اعتبار: 0
سپاس‌ها: 22
4 سپاس گرفته‌شده در 2 ارسال

RE: وینوس - خروجی آفلاین اندروید
(1398/4/7، 06:11 عصر)sirra.rozblog.com نوشته است: سلام میخواستم بدونم وینوس روی سیستم32 بیتی ران میشه؟؟؟؟؟
و تا چه تارگت اس دی ک خروجی میده؟؟؟؟؟؟؟؟؟؟؟؟؟؟؟؟؟؟؟؟؟؟؟؟؟؟؟؟

32 بیتی فک نکنم
فعلا تا 25 رو پوشش میده

(1398/4/7، 10:50 صبح)hiddendanger نوشته است:
(1398/4/7، 10:45 صبح)Amir DARK نوشته است: *
********** BUILD STARTED AT 1398/04/07 104106 **********
*


You have been opted out of telemetry. To change this, run: cordova telemetry on.
Removing platform android from config.xml file...



You have been opted out of telemetry. To change this, run: cordova telemetry on.
Adding android project...
Creating Cordova project for the Android platform:
Path: platforms\android
Package: ir.zgames.test
Name: Test
Activity: MainActivity
Android target: android-25
Subproject Path: CordovaLib
Android project created with [email protected]
Installing "vinoos-canvasplus" for android
Subproject Path: CordovaLib
--save flag or autosave detected
Saving [email protected]:\pack_vinoos\vinoos\Data\platforms\6.2.3.tgz into config.xml file ...



You have been opted out of telemetry. To change this, run: cordova telemetry on.
ANDROID_HOME=D:\pack_vinoos\sdkv\platforms
JAVA_HOME=C:\Program Files\Java\jdk1.8.0_172
:wrapper

BUILD SUCCESSFUL

Total time: 4.108 secs
Picked up _JAVA_OPTIONS: -Xmx2g
Subproject Path: CordovaLib
Failed to notify ProjectEvaluationListener.afterEvaluate(), but primary configuration failure takes precedence.
java.lang.IllegalStateException: buildToolsVersion is not specified.
at com.google.common.base.Preconditions.checkState(Preconditions.java:173)
at com.android.build.gradle.BasePlugin.createAndroidTasks(BasePlugin.java:645)
at com.android.build.gradle.BasePlugin$10.call(BasePlugin.java:608)
at com.android.build.gradle.BasePlugin$10.call(BasePlugin.java:605)
at com.android.builder.profile.ThreadRecorder.record(ThreadRecorder.java:156)
at com.android.builder.profile.ThreadRecorder.record(ThreadRecorder.java:120)
at com.android.build.gradle.BasePlugin.lambda$createTasks$1(BasePlugin.java:603)
at org.gradle.internal.event.BroadcastDispatch$ActionInvocationHandler.dispatch(BroadcastDispatch.java:93)
at org.gradle.internal.event.BroadcastDispatch$ActionInvocationHandler.dispatch(BroadcastDispatch.java:82)
at org.gradle.internal.event.AbstractBroadcastDispatch.dispatch(AbstractBroadcastDispatch.java:44)
at org.gradle.internal.event.BroadcastDispatch.dispatch(BroadcastDispatch.java:79)
at org.gradle.internal.event.BroadcastDispatch.dispatch(BroadcastDispatch.java:30)
at org.gradle.internal.dispatch.ProxyDispatchAdapter$DispatchingInvocationHandler.invoke(ProxyDispatchAdapter.java:93)
at com.sun.proxy.$Proxy16.afterEvaluate(Unknown Source)
at org.gradle.configuration.project.LifecycleProjectEvaluator.notifyAfterEvaluate(LifecycleProjectEvaluator.java:82)
at org.gradle.configuration.project.LifecycleProjectEvaluator.doConfigure(LifecycleProjectEvaluator.java:76)
at org.gradle.configuration.project.LifecycleProjectEvaluator.access$000(LifecycleProjectEvaluator.java:33)
at org.gradle.configuration.project.LifecycleProjectEvaluator$1.execute(LifecycleProjectEvaluator.java:53)
at org.gradle.configuration.project.LifecycleProjectEvaluator$1.execute(LifecycleProjectEvaluator.java:50)
at org.gradle.internal.Transformers$4.transform(Transformers.java:169)
at org.gradle.internal.progress.DefaultBuildOperationExecutor.run(DefaultBuildOperationExecutor.java:106)
at org.gradle.internal.progress.DefaultBuildOperationExecutor.run(DefaultBuildOperationExecutor.java:61)
at org.gradle.configuration.project.LifecycleProjectEvaluator.evaluate(LifecycleProjectEvaluator.java:50)
at org.gradle.api.internal.project.DefaultProject.evaluate(DefaultProject.java:628)
at org.gradle.api.internal.project.DefaultProject.evaluate(DefaultProject.java:129)
at org.gradle.execution.TaskPathProjectEvaluator.configure(TaskPathProjectEvaluator.java:35)
at org.gradle.execution.TaskPathProjectEvaluator.configureHierarchy(TaskPathProjectEvaluator.java:60)

at org.gradle.configuration.DefaultBuildConfigurer.configure(DefaultBuildConfigurer.java:38)
BUILD FAILED
at org.gradle.initialization.DefaultGradleLauncher$1.execute(DefaultGradleLauncher.java:161)

at org.gradle.initialization.DefaultGradleLauncher$1.execute(DefaultGradleLauncher.java:158)
Total time: 2.153 secs
at org.gradle.internal.Transformers$4.transform(Transformers.java:169)
at org.gradle.internal.progress.DefaultBuildOperationExecutor.run(DefaultBuildOperationExecutor.java:106)
at org.gradle.internal.progress.DefaultBuildOperationExecutor.run(DefaultBuildOperationExecutor.java:56)
at org.gradle.initialization.DefaultGradleLauncher.doBuildStages(DefaultGradleLauncher.java:158)
at org.gradle.initialization.DefaultGradleLauncher.doBuild(DefaultGradleLauncher.java:119)
at org.gradle.initialization.DefaultGradleLauncher.run(DefaultGradleLauncher.java:102)
at org.gradle.launcher.exec.GradleBuildController.run(GradleBuildController.java:71)
at org.gradle.tooling.internal.provider.ExecuteBuildActionRunner.run(ExecuteBuildActionRunner.java:28)
at org.gradle.launcher.exec.ChainingBuildActionRunner.run(ChainingBuildActionRunner.java:35)
at org.gradle.launcher.exec.InProcessBuildActionExecuter.execute(InProcessBuildActionExecuter.java:41)
at org.gradle.launcher.exec.InProcessBuildActionExecuter.execute(InProcessBuildActionExecuter.java:26)
at org.gradle.tooling.internal.provider.ContinuousBuildActionExecuter.execute(ContinuousBuildActionExecuter.java:75)
at org.gradle.tooling.internal.provider.ContinuousBuildActionExecuter.execute(ContinuousBuildActionExecuter.java:49)
at org.gradle.tooling.internal.provider.ServicesSetupBuildActionExecuter.execute(ServicesSetupBuildActionExecuter.java:44)
at org.gradle.tooling.internal.provider.ServicesSetupBuildActionExecuter.execute(ServicesSetupBuildActionExecuter.java:29)
at org.gradle.launcher.daemon.server.exec.ExecuteBuild.doBuild(ExecuteBuild.java:67)
at org.gradle.launcher.daemon.server.exec.BuildCommandOnly.execute(BuildCommandOnly.java:36)
at org.gradle.launcher.daemon.server.api.DaemonCommandExecution.proceed(DaemonCommandExecution.java:120)
at org.gradle.launcher.daemon.server.exec.WatchForDisconnection.execute(WatchForDisconnection.java:47)
at org.gradle.launcher.daemon.server.api.DaemonCommandExecution.proceed(DaemonCommandExecution.java:120)
at org.gradle.launcher.daemon.server.exec.ResetDeprecationLogger.execute(ResetDeprecationLogger.java:26)
at org.gradle.launcher.daemon.server.api.DaemonCommandExecution.proceed(DaemonCommandExecution.java:120)
at org.gradle.launcher.daemon.server.exec.RequestStopIfSingleUsedDaemon.execute(RequestStopIfSingleUsedDaemon.java:34)
at org.gradle.launcher.daemon.server.api.DaemonCommandExecution.proceed(DaemonCommandExecution.java:120)
at org.gradle.launcher.daemon.server.exec.ForwardClientInput$2.call(ForwardClientInput.java:74)
at org.gradle.launcher.daemon.server.exec.ForwardClientInput$2.call(ForwardClientInput.java:72)
at org.gradle.util.Swapper.swap(Swapper.java:38)
at org.gradle.launcher.daemon.server.exec.ForwardClientInput.execute(ForwardClientInput.java:72)
at org.gradle.launcher.daemon.server.api.DaemonCommandExecution.proceed(DaemonCommandExecution.java:120)
at org.gradle.launcher.daemon.server.exec.LogAndCheckHealth.execute(LogAndCheckHealth.java:55)
at org.gradle.launcher.daemon.server.api.DaemonCommandExecution.proceed(DaemonCommandExecution.java:120)
at org.gradle.launcher.daemon.server.exec.LogToClient.doBuild(LogToClient.java:60)
at org.gradle.launcher.daemon.server.exec.BuildCommandOnly.execute(BuildCommandOnly.java:36)
at org.gradle.launcher.daemon.server.api.DaemonCommandExecution.proceed(DaemonCommandExecution.java:120)
at org.gradle.launcher.daemon.server.exec.EstablishBuildEnvironment.doBuild(EstablishBuildEnvironment.java:72)
at org.gradle.launcher.daemon.server.exec.BuildCommandOnly.execute(BuildCommandOnly.java:36)
at org.gradle.launcher.daemon.server.api.DaemonCommandExecution.proceed(DaemonCommandExecution.java:120)
at org.gradle.launcher.daemon.server.exec.StartBuildOrRespondWithBusy$1.run(StartBuildOrRespondWithBusy.java:50)
at org.gradle.launcher.daemon.server.DaemonStateCoordinator$1.run(DaemonStateCoordinator.java:297)
at org.gradle.internal.concurrent.ExecutorPolicy$CatchAndRecordFailures.onExecute(ExecutorPolicy.java:54)
at org.gradle.internal.concurrent.StoppableExecutorImpl$1.run(StoppableExecutorImpl.java:40)
at java.util.concurrent.ThreadPoolExecutor.runWorker(ThreadPoolExecutor.java:1149)
at java.util.concurrent.ThreadPoolExecutor$Worker.run(ThreadPoolExecutor.java:624)
at java.lang.Thread.run(Thread.java:748)

FAILURE: Build failed with an exception.

* Where:
Script 'C:\Users\DELL\Documents\Vinoos\Projects\asd\platforms\android\CordovaLib\cordova.gradle' line: 64

* What went wrong:
A problem occurred evaluating root project 'android'.
> No installed build tools found. Install the Android build tools version 19.1.0 or higher.

* Try:
Run with --stacktrace option to get the stack trace. Run with --info or --debug option to get more log output.
Picked up _JAVA_OPTIONS: -Xmx2g
Error: cmd: Command failed with exit code 1 Error output:
Failed to notify ProjectEvaluationListener.afterEvaluate(), but primary configuration failure takes precedence.
java.lang.IllegalStateException: buildToolsVersion is not specified.
at com.google.common.base.Preconditions.checkState(Preconditions.java:173)
at com.android.build.gradle.BasePlugin.createAndroidTasks(BasePlugin.java:645)
at com.android.build.gradle.BasePlugin$10.call(BasePlugin.java:608)
at com.android.build.gradle.BasePlugin$10.call(BasePlugin.java:605)
at com.android.builder.profile.ThreadRecorder.record(ThreadRecorder.java:156)
at com.android.builder.profile.ThreadRecorder.record(ThreadRecorder.java:120)
at com.android.build.gradle.BasePlugin.lambda$createTasks$1(BasePlugin.java:603)
at org.gradle.internal.event.BroadcastDispatch$ActionInvocationHandler.dispatch(BroadcastDispatch.java:93)
at org.gradle.internal.event.BroadcastDispatch$ActionInvocationHandler.dispatch(BroadcastDispatch.java:82)
at org.gradle.internal.event.AbstractBroadcastDispatch.dispatch(AbstractBroadcastDispatch.java:44)
at org.gradle.internal.event.BroadcastDispatch.dispatch(BroadcastDispatch.java:79)
at org.gradle.internal.event.BroadcastDispatch.dispatch(BroadcastDispatch.java:30)
at org.gradle.internal.dispatch.ProxyDispatchAdapter$DispatchingInvocationHandler.invoke(ProxyDispatchAdapter.java:93)
at com.sun.proxy.$Proxy16.afterEvaluate(Unknown Source)
at org.gradle.configuration.project.LifecycleProjectEvaluator.notifyAfterEvaluate(LifecycleProjectEvaluator.java:82)
at org.gradle.configuration.project.LifecycleProjectEvaluator.doConfigure(LifecycleProjectEvaluator.java:76)
at org.gradle.configuration.project.LifecycleProjectEvaluator.access$000(LifecycleProjectEvaluator.java:33)
at org.gradle.configuration.project.LifecycleProjectEvaluator$1.execute(LifecycleProjectEvaluator.java:53)
at org.gradle.configuration.project.LifecycleProjectEvaluator$1.execute(LifecycleProjectEvaluator.java:50)
at org.gradle.internal.Transformers$4.transform(Transformers.java:169)
at org.gradle.internal.progress.DefaultBuildOperationExecutor.run(DefaultBuildOperationExecutor.java:106)
at org.gradle.internal.progress.DefaultBuildOperationExecutor.run(DefaultBuildOperationExecutor.java:61)
at org.gradle.configuration.project.LifecycleProjectEvaluator.evaluate(LifecycleProjectEvaluator.java:50)
at org.gradle.api.internal.project.DefaultProject.evaluate(DefaultProject.java:628)
at org.gradle.api.internal.project.DefaultProject.evaluate(DefaultProject.java:129)
at org.gradle.execution.TaskPathProjectEvaluator.configure(TaskPathProjectEvaluator.java:35)
at org.gradle.execution.TaskPathProjectEvaluator.configureHierarchy(TaskPathProjectEvaluator.java:60)
at org.gradle.configuration.DefaultBuildConfigurer.configure(DefaultBuildConfigurer.java:38)
at org.gradle.initialization.DefaultGradleLauncher$1.execute(DefaultGradleLauncher.java:161)
at org.gradle.initialization.DefaultGradleLauncher$1.execute(DefaultGradleLauncher.java:158)

at org.gradle.internal.Transformers$4.transform(Transformers.java:169)
at org.gradle.internal.progress.DefaultBuildOperationExecutor.run(DefaultBuildOperationExecutor.java:106)
at org.gradle.internal.progress.DefaultBuildOperationExecutor.run(DefaultBuildOperationExecutor.java:56)
at org.gradle.initialization.DefaultGradleLauncher.doBuildStages(DefaultGradleLauncher.java:158)
at org.gradle.initialization.DefaultGradleLauncher.doBuild(DefaultGradleLauncher.java:119)
at org.gradle.initialization.DefaultGradleLauncher.run(DefaultGradleLauncher.java:102)
at org.gradle.launcher.exec.GradleBuildController.run(GradleBuildController.java:71)
at org.gradle.tooling.internal.provider.ExecuteBuildActionRunner.run(ExecuteBuildActionRunner.java:28)
at org.gradle.launcher.exec.ChainingBuildActionRunner.run(ChainingBuildActionRunner.java:35)
at org.gradle.launcher.exec.InProcessBuildActionExecuter.execute(InProcessBuildActionExecuter.java:41)
at org.gradle.launcher.exec.InProcessBuildActionExecuter.execute(InProcessBuildActionExecuter.java:26)
at org.gradle.tooling.internal.provider.ContinuousBuildActionExecuter.execute(ContinuousBuildActionExecuter.java:75)
at org.gradle.tooling.internal.provider.ContinuousBuildActionExecuter.execute(ContinuousBuildActionExecuter.java:49)
at org.gradle.tooling.internal.provider.ServicesSetupBuildActionExecuter.execute(ServicesSetupBuildActionExecuter.java:44)
at org.gradle.tooling.internal.provider.ServicesSetupBuildActionExecuter.execute(ServicesSetupBuildActionExecuter.java:29)
at org.gradle.launcher.daemon.server.exec.ExecuteBuild.doBuild(ExecuteBuild.java:67)
at org.gradle.launcher.daemon.server.exec.BuildCommandOnly.execute(BuildCommandOnly.java:36)
at org.gradle.launcher.daemon.server.api.DaemonCommandExecution.proceed(DaemonCommandExecution.java:120)
at org.gradle.launcher.daemon.server.exec.WatchForDisconnection.execute(WatchForDisconnection.java:47)
at org.gradle.launcher.daemon.server.api.DaemonCommandExecution.proceed(DaemonCommandExecution.java:120)
at org.gradle.launcher.daemon.server.exec.ResetDeprecationLogger.execute(ResetDeprecationLogger.java:26)
at org.gradle.launcher.daemon.server.api.DaemonCommandExecution.proceed(DaemonCommandExecution.java:120)
at org.gradle.launcher.daemon.server.exec.RequestStopIfSingleUsedDaemon.execute(RequestStopIfSingleUsedDaemon.java:34)
at org.gradle.launcher.daemon.server.api.DaemonCommandExecution.proceed(DaemonCommandExecution.java:120)
at org.gradle.launcher.daemon.server.exec.ForwardClientInput$2.call(ForwardClientInput.java:74)
at org.gradle.launcher.daemon.server.exec.ForwardClientInput$2.call(ForwardClientInput.java:72)
at org.gradle.util.Swapper.swap(Swapper.java:38)
at org.gradle.launcher.daemon.server.exec.ForwardClientInput.execute(ForwardClientInput.java:72)
at org.gradle.launcher.daemon.server.api.DaemonCommandExecution.proceed(DaemonCommandExecution.java:120)
at org.gradle.launcher.daemon.server.exec.LogAndCheckHealth.execute(LogAndCheckHealth.java:55)
at org.gradle.launcher.daemon.server.api.DaemonCommandExecution.proceed(DaemonCommandExecution.java:120)
at org.gradle.launcher.daemon.server.exec.LogToClient.doBuild(LogToClient.java:60)
at org.gradle.launcher.daemon.server.exec.BuildCommandOnly.execute(BuildCommandOnly.java:36)
at org.gradle.launcher.daemon.server.api.DaemonCommandExecution.proceed(DaemonCommandExecution.java:120)
at org.gradle.launcher.daemon.server.exec.EstablishBuildEnvironment.doBuild(EstablishBuildEnvironment.java:72)
at org.gradle.launcher.daemon.server.exec.BuildCommandOnly.execute(BuildCommandOnly.java:36)
at org.gradle.launcher.daemon.server.api.DaemonCommandExecution.proceed(DaemonCommandExecution.java:120)
at org.gradle.launcher.daemon.server.exec.StartBuildOrRespondWithBusy$1.run(StartBuildOrRespondWithBusy.java:50)
at org.gradle.launcher.daemon.server.DaemonStateCoordinator$1.run(DaemonStateCoordinator.java:297)
at org.gradle.internal.concurrent.ExecutorPolicy$CatchAndRecordFailures.onExecute(ExecutorPolicy.java:54)
at org.gradle.internal.concurrent.StoppableExecutorImpl$1.run(StoppableExecutorImpl.java:40)
at java.util.concurrent.ThreadPoolExecutor.runWorker(ThreadPoolExecutor.java:1149)
at java.util.concurrent.ThreadPoolExecutor$Worker.run(ThreadPoolExecutor.java:624)
at java.lang.Thread.run(Thread.java:748)

FAILURE: Build failed with an exception.

* Where:
Script 'C:\Users\DELL\Documents\Vinoos\Projects\asd\platforms\android\CordovaLib\cordova.gradle' line: 64

* What went wrong:
A problem occurred evaluating root project 'android'.
> No installed build tools found. Install the Android build tools version 19.1.0 or higher.

* Try:
Run with --stacktrace option to get the stack trace. Run with --info or --debug option to get more log output.
Picked up _JAVA_OPTIONS: -Xmx2g



-----------------------------------------
موقع بیلد این ارور رو میده
همه ی پیش نیاز ها هم به درستی نصب شده 

میگه توی android sdk ، بیلد تولز نسخه 19.1.0 یا بالاتر رو نصب کنید

بیلد تولز 21 و 26 نصبه ولی ارور میده
1398/4/7، 08:01 عصر
ارسال‌ها پاسخ
kiarash آفلاین
مدیر تخصصی بخش کانستراکت 2
**
فروشنده انجمن

ارسال‌ها: 730
موضوع‌ها: 3
تاریخ عضویت: آبا 1397
اعتبار: 15
مکان: همدان،ملایر
سپاس‌ها: 175
823 سپاس گرفته‌شده در 468 ارسال

RE: وینوس - خروجی آفلاین اندروید
(1398/4/7، 06:11 عصر)sirra.rozblog.com نوشته است: سلام میخواستم بدونم وینوس روی سیستم32 بیتی ران میشه؟؟؟؟؟
و تا چه تارگت اس دی ک خروجی میده؟؟؟؟؟؟؟؟؟؟؟؟؟؟؟؟؟؟؟؟؟؟؟؟؟؟؟؟

بله ران میشه . من خودم ویندوزم 32 بیتی هست.
(1398/4/7، 08:01 عصر)Amir DARK نوشته است:
(1398/4/7، 06:11 عصر)sirra.rozblog.com نوشته است: سلام میخواستم بدونم وینوس روی سیستم32 بیتی ران میشه؟؟؟؟؟
و تا چه تارگت اس دی ک خروجی میده؟؟؟؟؟؟؟؟؟؟؟؟؟؟؟؟؟؟؟؟؟؟؟؟؟؟؟؟

32 بیتی فک نکنم
فعلا تا 25 رو پوشش میده

لطفا چیزی رو که نمیدونید پاسخ ندید تا کاربر ها گمراه نشن!!!
فرا کانستراکت / FARA CONSTRUCT

مرجع کانستراکت ایران
کانال رسمی مرجع تخصصی کانستراکت
si2.ir و construct2.ir

برای حمایت از ما

1398/4/8، 04:59 عصر
ارسال‌ها پاسخ
miladesign آفلاین
Senior Member
****

ارسال‌ها: 325
موضوع‌ها: 31
تاریخ عضویت: خرد 1395
اعتبار: 43
مکان: خرمشهر
سپاس‌ها: 162
1167 سپاس گرفته‌شده در 279 ارسال

RE: وینوس - خروجی آفلاین اندروید
سلام

دوستانی که مشکل اندروید 26 رو دارن میتونن فایل زیر رو دانلود کنن و توی محل نصب وینوس پوشه Data و داخل پوشه Platforms جایگزین کنن تا بتونن با پلتفرم 26 خروجی بگیرن.

http://vinoos.ir/download/1.2.2/6.2.3.tgz
1398/4/14، 06:55 عصر
ارسال‌ها پاسخ
محمد 82 آفلاین
عضو فعّال
عضو عادی

ارسال‌ها: 1,593
موضوع‌ها: 240
تاریخ عضویت: مرد 1395
اعتبار: 18
سپاس‌ها: 258
1049 سپاس گرفته‌شده در 588 ارسال

RE: وینوس - خروجی آفلاین اندروید
اندروید 28 چی ؟؟؟؟ اون بهتره که  20

البته ممنون ولی چرا 28 نه ؟؟؟
استودیو بازیسازی ایروید
جدید ترین ها : شهرزاد ، دربند;1357 و ATOM
[تصویر:  ads.gif]
1398/4/14، 07:26 عصر
ارسال‌ها پاسخ
miladesign آفلاین
Senior Member
****

ارسال‌ها: 325
موضوع‌ها: 31
تاریخ عضویت: خرد 1395
اعتبار: 43
مکان: خرمشهر
سپاس‌ها: 162
1167 سپاس گرفته‌شده در 279 ارسال

RE: وینوس - خروجی آفلاین اندروید
کوردوای 6.5.0 بیشتر از 26 ساپورت نمیکنه
از طرفی وینوس بیشتر از کوردوای 6.5.0 ساپورت نمیکنه
1398/4/14، 09:00 عصر
ارسال‌ها پاسخ
kiarash آفلاین
مدیر تخصصی بخش کانستراکت 2
**
فروشنده انجمن

ارسال‌ها: 730
موضوع‌ها: 3
تاریخ عضویت: آبا 1397
اعتبار: 15
مکان: همدان،ملایر
سپاس‌ها: 175
823 سپاس گرفته‌شده در 468 ارسال

RE: وینوس - خروجی آفلاین اندروید
خب بی زحمت اگه میشه کاری کنید که پشتیبانی کنه که خیاله ما ما هم راحت شه.
بعد لطفا یه کاری کنید فرایند خروجی اسون تر بشه.
من خواستم اولین بازیمو منتشر کنم ولی به خاطر نداشتن خروجی گیر موندم رو هوا.
لطفا کمکمون کنید.
فرا کانستراکت / FARA CONSTRUCT

مرجع کانستراکت ایران
کانال رسمی مرجع تخصصی کانستراکت
si2.ir و construct2.ir

برای حمایت از ما

1398/4/15، 02:33 صبح
ارسال‌ها پاسخ
محمد 82 آفلاین
عضو فعّال
عضو عادی

ارسال‌ها: 1,593
موضوع‌ها: 240
تاریخ عضویت: مرد 1395
اعتبار: 18
سپاس‌ها: 258
1049 سپاس گرفته‌شده در 588 ارسال

RE: وینوس - خروجی آفلاین اندروید
با حرفتون موافقم . اما درمورد خروجی که برید یه دوستی تو یه تاپیکی پیش نیاز هاشو جمع کرده بود و همه رو ویدئویی اموزش میداد . دانلود کنید ، حدودا 1 گیگه و طبق اون عمل کنید . من خودم 1 سال مونده بودم واسه راه اندازی وینوس ، با دانلود این پکیج تو 1 روز درستش کردم . ضمنا با این نسخه جدید که همین امروز اقا میلاد گذاشتن خیلی بهتر شده وینوس . یعنی خروجی که من تو 10 دقیقه میگرفتم تو 2 دقیقه میگیره .
استودیو بازیسازی ایروید
جدید ترین ها : شهرزاد ، دربند;1357 و ATOM
[تصویر:  ads.gif]
1398/4/15، 03:19 صبح
ارسال‌ها پاسخ
kiarash آفلاین
مدیر تخصصی بخش کانستراکت 2
**
فروشنده انجمن

ارسال‌ها: 730
موضوع‌ها: 3
تاریخ عضویت: آبا 1397
اعتبار: 15
مکان: همدان،ملایر
سپاس‌ها: 175
823 سپاس گرفته‌شده در 468 ارسال

RE: وینوس - خروجی آفلاین اندروید
خب با همون دارم کار می کنم ولی باز هم میگه جاوا مشکل داره .
اونوقت خروجی نمیگیره
فرا کانستراکت / FARA CONSTRUCT

مرجع کانستراکت ایران
کانال رسمی مرجع تخصصی کانستراکت
si2.ir و construct2.ir

برای حمایت از ما

1398/4/15، 04:34 صبح
ارسال‌ها پاسخ


موضوع‌های مشابه…
موضوع نویسنده پاسخ بازدید آخرین ارسال
  نیازمند فایل نصبی وینوس ary_aryyyy 0 50 1399/1/17، 02:14 عصر
آخرین ارسال: ary_aryyyy
  ساین کردن apk saeed 1 76 1399/1/10، 03:37 عصر
آخرین ارسال: kiarash
Star سیستم ثبت امتیاز آنلاین پارسکور miladesign 82 8,994 1399/1/9، 08:08 عصر
آخرین ارسال: oak
Information نرم افزار جیسون ساز آپدیت شد ( آپدیت 1.1.3 )... oak 34 1,182 1398/11/29، 10:36 عصر
آخرین ارسال: ""M.gh""
  نصف شدن بکگراند hb1221 4 173 1398/11/23، 12:23 عصر
آخرین ارسال: محمد 82

پرش به انجمن: