انجمن تخصّصی کانستراکت

نسخه‌ی کامل: وینوس - خروجی آفلاین اندروید
شما در حال مشاهده‌ی نسخه‌ی متنی این صفحه می‌باشید. مشاهده‌ی نسخه‌ی کامل با قالب بندی مناسب.
صفحه‌ها: 1 2 3 4 5 6 7 8 9 10 11 12 13 14 15 16 17 18 19 20 21 22 23 24 25 26 27 28 29 30 31 32 33 34 35 36 37 38 39 40 41 42
من خروجی گرفتم و این ارور می دهد
همه بخش ها رو نصب کردم با کوردوا خروجی گرفتم ولی وینوس این پیغام خطا را می دهد.
خواهشند در نگارش بعدی کپی کردن یا ذخیره پیام کنسول هم اضافه کنید
کد:
BUILD SUCCESSFUL in 8s
1 actionable task: 1 executed
Subproject Path: CordovaLib

FAILURE: Build failed with an exception.


BUILD FAILED
* What went wrong:

A problem occurred configuring root project 'android'.
Total time: 13.415 secs
> Could not resolve all dependencies for configuration ':classpath'.
  > Could not resolve com.android.tools.build:gradle:2.2.1.
    Required by:
        project :
     > Could not resolve com.android.tools.build:gradle:2.2.1.
        > Could not get resource 'https://repo1.maven.org/maven2/com/android/tools/build/gradle/2.2.1/gradle-2.2.1.pom'.
           > Could not GET 'https://repo1.maven.org/maven2/com/android/tools/build/gradle/2.2.1/gradle-2.2.1.pom'.
              > Connect to localhost:52115 [localhost/127.0.0.1, localhost/0:0:0:0:0:0:0:1] failed: Connection refused: connect
     > Could not resolve com.android.tools.build:gradle:2.2.1.
        > Could not get resource 'https://jcenter.bintray.com/com/android/tools/build/gradle/2.2.1/gradle-2.2.1.pom'.
           > Could not GET 'https://jcenter.bintray.com/com/android/tools/build/gradle/2.2.1/gradle-2.2.1.pom'.
              > Connect to localhost:52115 [localhost/127.0.0.1, localhost/0:0:0:0:0:0:0:1] failed: Connection refused: connect

* Try:
Run with --stacktrace option to get the stack trace. Run with --info or --debug option to get more log output.
cmd: Command failed with exit code 1 Error output:
FAILURE: Build failed with an exception.

* What went wrong:
A problem occurred configuring root project 'android'.
> Could not resolve all dependencies for configuration ':classpath'.
  > Could not resolve com.android.tools.build:gradle:2.2.1.
    Required by:
        project :
     > Could not resolve com.android.tools.build:gradle:2.2.1.
        > Could not get resource 'https://repo1.maven.org/maven2/com/android/tools/build/gradle/2.2.1/gradle-2.2.1.pom'.
           > Could not GET 'https://repo1.maven.org/maven2/com/android/tools/build/gradle/2.2.1/gradle-2.2.1.pom'.
              > Connect to localhost:52115 [localhost/127.0.0.1, localhost/0:0:0:0:0:0:0:1] failed: Connection refused: connect
     > Could not resolve com.android.tools.build:gradle:2.2.1.
        > Could not get resource 'https://jcenter.bintray.com/com/android/tools/build/gradle/2.2.1/gradle-2.2.1.pom'.
           > Could not GET 'https://jcenter.bintray.com/com/android/tools/build/gradle/2.2.1/gradle-2.2.1.pom'.
              > Connect to localhost:52115 [localhost/127.0.0.1, localhost/0:0:0:0:0:0:0:1] failed: Connection refused: connect

* Try:
Run with --stacktrace option to get the stack trace. Run with --info or --debug option to get more log output.
می دانم مشکل از کجاست می خواهد یکسری کتابخانه دریافت کند که بدلیل قدیمی بود لینک و نبودن آنها نمی تواند دانلود کند
نمی شود گردل بروز کنی و نگارش 4 بکار ببرید؟
مشکل کجاست؟
(1397/12/3، 03:44 صبح)shazde نوشته است: [ -> ]خواهش میکنم
امیدوارم مشکل از sdk باشه
ولی اگه بازم مشکل داشت , پلاگین ADSDK رو حذف کنید و خروجی رو تست کنید.
ممکنه پلاگین تپسل و ADSDK  با هم تداخل داشته باشن.

تپسل و ADSDK پاک شد.
درست شد!
مرسی...
امیدوارم فقط ADSDK تداخل داشته باشه چون تپسل منبع درامده!
درکل مرسی آقا محمد
(1397/12/3، 05:30 عصر)mehrdad.ch نوشته است: [ -> ]سرپرستی کارها (task manager)  ویندوز را باز کنید. در بخش پردازش ها (process) . 
1- این برنامه باز است ویندوز نمی تواند ببندش
2- یک منبع که برنامه وینوس با آن کار می کند در اختیار برنامه دیگری است.

1- رفتم بخش پردازش ولی نبود
2- نمی دونم اگر هم هست
من الان باید چه کار کنم؟ 


کلیک راست روی برنامه و با run admin انتخاب کن

(1397/12/4، 12:08 صبح)mehrdad.ch نوشته است: [ -> ]کلیک راست روی برنامه و با run admin انتخاب کن

مشکلم حل شد فقط باید محل نصبشو عوض می کردم

الان مشکلم این اروره

کد:
Failed to install 'vinoos-canvasplus-arm7':Error: cmd: Command failed with exit code ENOENT
Error: cmd: Command failed with exit code ENOENT
   at ChildProcess.whenDone (C:\Users\Amin\AppData\Roaming\npm\node_modules\cordova\node_modules\cordova-common\src\superspawn.js:169:23)
   at ChildProcess.emit (events.js:189:13)
   at Process.ChildProcess._handle.onexit (internal/child_process.js:246:12)
   at onErrorNT (internal/child_process.js:415:16)
   at process._tickCallback (internal/process/next_tick.js:63:19)
برنامه وینوس نود جی اس و کردوا را شناسایی کرده.
اره شناسایی کرده
ولی بازم این ارور میاد
شما پیش از تغییر آدرس با وینوس پروژه خروجی ساختید.
چون شما در جای دیگری نصب کردید. بهتر است پروژه وینوس را حذف کرده و از نو پروژه بسازید چون آدرس فایل ها پیشین در پروژه ذخیره شده است. نمی تواند فایل های مورد نیاز خود برای ساخت اندروید پیدا کند.

کسی می داند مشکل من کجاست؟
برو به

راستی انجمن در بخش پیام ها دستور goto نداره که نخواهیم پیام را دوباره نویسی کنیم و یا در بخش پاسخ پنل باز و بسته شو برای پاسخ های تو درتو
(1397/12/4، 10:09 صبح)mehrdad.ch نوشته است: [ -> ]شما پیش از تغییر آدرس با وینوس پروژه خروجی ساختید.
چون شما در جای دیگری نصب کردید. بهتر است پروژه وینوس را حذف کرده و از نو پروژه بسازید چون آدرس فایل ها پیشین در پروژه ذخیره شده است. نمی تواند فایل های مورد نیاز خود برای ساخت اندروید پیدا کند.

کسی می داند مشکل من کجاست؟
برو به

راستی انجمن در بخش پیام ها دستور goto نداره که نخواهیم پیام را دوباره نویسی کنیم و یا در بخش پاسخ پنل باز و بسته شو برای پاسخ های تو درتو

اون سایتی که فایل ازش دانلود میشه فی.لت.ره و باید از فی.لت.رش.کن استفاده کنید.
با فیلتر شکن هم  نشد.
چون لینک یا پیوندها روی مرورگر جستجو کردم با خطا 404 یعنی آدرس درست نیست روبرو شدم.
نمونه
اکنون کتابخانه های maven زیر دامنه گوگل است که پیش از این خودش در یک دامنه جداگانه بوده است. maven
صفحه‌ها: 1 2 3 4 5 6 7 8 9 10 11 12 13 14 15 16 17 18 19 20 21 22 23 24 25 26 27 28 29 30 31 32 33 34 35 36 37 38 39 40 41 42